{"text_format":"1","workbook":"xlsx","n_sheets":30,"sheets":["Point Score","26-10-14","2-11-14","9-11-14","16-11-14","23-11-14","30-11-14","7-12-14","14-12-14","11-01-15","18-01-15","25-01-15","26-01-15","1-02-15","8-02-15","1-03-15","8-03-15","15-03-15","22-03-15","12-10-14","19-10-14","BLANK","Contacts","Starters","Entrants","Schedule","11-03-12","18-03-12","25-03-12","Point Score OLD"],"not_rendered":{"charts":0,"images":0,"macros":1,"external_links":0,"defined_names":31,"comments":23,"pivot_tables":0},"unopened":[],"bounds":{"document_bytes":16777216,"sheet_cells":100000,"rows_first":2000,"rows_last":500,"rows_between":2000,"halvings":0,"cell_chars":16384,"cell_head_chars":4096},"cells_cut":0,"cells_raw":0,"read":"whole","date_system":"1900"}

{"sheet":"Point Score","index":0,"n_rows":177,"n_cols":37,"rows_kept":177,"cut":false,"hidden":false,"merged":[]}
["AUSTRALIAN 18Ft League - 2014/15 Club Championship Point Score",null,null,null,null,null,null,null,null,null,null,null,null,null,null,null,null,null,null,null,null,null,null,null,null,null,null,null,null,null,null,"Ctrl+R to Sort by Recall"]
[null,null,{"$f":"'26-10-14'!G4","v":"2014-10-26"},{"$f":"'9-11-14'!G4","v":"2014-11-09"},{"$f":"'23-11-14'!G4","v":"2014-11-23"},{"$f":"'7-12-14'!G4","v":"2014-12-07"},{"$f":"'11-01-15'!G4","v":"2015-01-11"},{"$f":"'18-01-15'!G4","v":"2015-01-18"},{"$f":"'25-01-15'!G4","v":"2015-01-25"},{"$f":"'26-01-15'!G4","v":"2015-01-26"},{"$f":"'1-02-15'!G4","v":"2015-02-01"},{"$f":"'8-03-15'!G4","v":"2015-03-08"},{"$f":"'15-03-15'!G4","v":"2015-03-15"},{"$f":"'25-03-12'!G4","v":"00:00:00"},null,null,null,null,null,null,null,null,null,null,null,null,null,null,null,null,null,null,"Ctrl+P to Sort by Points"]
["Recall","Name","R1","R2","R3","R4","R5","R6","R7","R8","R9","R10","R11","R11",null,null,null,null,"Total","POS"]
[1,"THURLOW FISHER LAWYERS",{"$f":"'26-10-14'!$P15","v":0},{"$f":"'9-11-14'!$P15","v":0},{"$f":"'23-11-14'!$P15","v":0},{"$f":"'7-12-14'!$P15","v":0},{"$f":"'11-01-15'!$P15","v":0},{"$f":"'18-01-15'!$P15","v":0},{"$f":"'25-01-15'!$P15","v":0},{"$f":"'26-01-15'!$P15","v":0},{"$f":"'1-02-15'!P15","v":0},{"$f":"'8-03-15'!$P15","v":0},{"$f":"'15-03-15'!$P15","v":0},{"$f":"'25-03-12'!$P15","v":0},null,null,null,null,{"$f":"SUM(C4:R4)","v":0},1]
[2,"YANDOO",{"$f":"'26-10-14'!$P16","v":0},{"$f":"'9-11-14'!$P16","v":0},{"$f":"'23-11-14'!$P16","v":0},{"$f":"'7-12-14'!$P16","v":0},{"$f":"'11-01-15'!$P16","v":0},{"$f":"'18-01-15'!$P16","v":0},{"$f":"'25-01-15'!$P16","v":0},{"$f":"'26-01-15'!$P16","v":0},{"$f":"'1-02-15'!P16","v":0},{"$f":"'8-03-15'!$P16","v":0},{"$f":"'15-03-15'!$P16","v":0},{"$f":"'25-03-12'!$P16","v":0},null,null,null,null,0,2]
[3,"ASKO GORENJE",{"$f":"'26-10-14'!$P17","v":0},{"$f":"'9-11-14'!$P17","v":0},{"$f":"'23-11-14'!$P17","v":0},{"$f":"'7-12-14'!$P17","v":0},{"$f":"'11-01-15'!$P17","v":0},{"$f":"'18-01-15'!$P17","v":0},{"$f":"'25-01-15'!$P17","v":0},{"$f":"'26-01-15'!$P17","v":0},{"$f":"'1-02-15'!P17","v":0},{"$f":"'8-03-15'!$P17","v":0},{"$f":"'15-03-15'!$P17","v":0},{"$f":"'25-03-12'!$P17","v":0},null,null,null,null,0,3]
[4,"DE’LONGHI",{"$f":"'26-10-14'!$P18","v":0},{"$f":"'9-11-14'!$P18","v":0},{"$f":"'23-11-14'!$P18","v":0},{"$f":"'7-12-14'!$P18","v":0},{"$f":"'11-01-15'!$P18","v":0},{"$f":"'18-01-15'!$P18","v":0},{"$f":"'25-01-15'!$P18","v":0},{"$f":"'26-01-15'!$P18","v":0},{"$f":"'1-02-15'!P18","v":0},{"$f":"'8-03-15'!$P18","v":0},{"$f":"'15-03-15'!$P18","v":0},{"$f":"'25-03-12'!$P18","v":0},null,null,null,null,0,4]
[5,"APPLIANCESONLINE.COM.AU",{"$f":"'26-10-14'!$P19","v":0},{"$f":"'9-11-14'!$P19","v":0},{"$f":"'23-11-14'!$P19","v":0},{"$f":"'7-12-14'!$P19","v":0},{"$f":"'11-01-15'!$P19","v":0},{"$f":"'18-01-15'!$P19","v":0},{"$f":"'25-01-15'!$P19","v":0},{"$f":"'26-01-15'!$P19","v":0},{"$f":"'1-02-15'!P19","v":0},{"$f":"'8-03-15'!$P19","v":0},{"$f":"'15-03-15'!$P19","v":0},{"$f":"'25-03-12'!$P19","v":0},null,null,null,null,0,5]
[6,"COOPERS 62-RAG & FAMISH HOTEL",{"$f":"'26-10-14'!$P20","v":0},{"$f":"'9-11-14'!$P20","v":0},{"$f":"'23-11-14'!$P20","v":0},{"$f":"'7-12-14'!$P20","v":0},{"$f":"'11-01-15'!$P20","v":0},{"$f":"'18-01-15'!$P20","v":0},{"$f":"'25-01-15'!$P20","v":0},{"$f":"'26-01-15'!$P20","v":0},{"$f":"'1-02-15'!P20","v":0},{"$f":"'8-03-15'!$P20","v":0},{"$f":"'15-03-15'!$P20","v":0},{"$f":"'25-03-12'!$P20","v":0},null,null,null,null,0,6]
[7,"GOTTA LOVE IT 7",{"$f":"'26-10-14'!$P21","v":0},{"$f":"'9-11-14'!$P21","v":0},{"$f":"'23-11-14'!$P21","v":0},{"$f":"'7-12-14'!$P21","v":0},{"$f":"'11-01-15'!$P21","v":0},{"$f":"'18-01-15'!$P21","v":0},{"$f":"'25-01-15'!$P21","v":0},{"$f":"'26-01-15'!$P21","v":0},{"$f":"'1-02-15'!P21","v":0},{"$f":"'8-03-15'!$P21","v":0},{"$f":"'15-03-15'!$P21","v":0},{"$f":"'25-03-12'!$P21","v":0},null,null,null,null,0,7]
[8,"SMEG",{"$f":"'26-10-14'!$P22","v":0},{"$f":"'9-11-14'!$P22","v":0},{"$f":"'23-11-14'!$P22","v":0},{"$f":"'7-12-14'!$P22","v":0},{"$f":"'11-01-15'!$P22","v":0},{"$f":"'18-01-15'!$P22","v":0},{"$f":"'25-01-15'!$P22","v":0},{"$f":"'26-01-15'!$P22","v":0},{"$f":"'1-02-15'!P22","v":0},{"$f":"'8-03-15'!$P22","v":0},{"$f":"'15-03-15'!$P22","v":0},{"$f":"'25-03-12'!$P22","v":0},null,null,null,null,0,8]
[9,"PURE BLONDE",{"$f":"'26-10-14'!$P23","v":0},{"$f":"'9-11-14'!$P23","v":0},{"$f":"'23-11-14'!$P23","v":0},{"$f":"'7-12-14'!$P23","v":0},{"$f":"'11-01-15'!$P23","v":0},{"$f":"'18-01-15'!$P23","v":0},{"$f":"'25-01-15'!$P23","v":0},{"$f":"'26-01-15'!$P23","v":0},{"$f":"'1-02-15'!P23","v":0},{"$f":"'8-03-15'!$P23","v":0},{"$f":"'15-03-15'!$P23","v":0},{"$f":"'25-03-12'!$P23","v":0},null,null,null,null,0,9]
[10,"FISHER & PAYKEL",{"$f":"'26-10-14'!$P24","v":0},{"$f":"'9-11-14'!$P24","v":0},{"$f":"'23-11-14'!$P24","v":0},{"$f":"'7-12-14'!$P24","v":0},{"$f":"'11-01-15'!$P24","v":0},{"$f":"'18-01-15'!$P24","v":0},{"$f":"'25-01-15'!$P24","v":0},{"$f":"'26-01-15'!$P24","v":0},{"$f":"'1-02-15'!P24","v":0},{"$f":"'8-03-15'!$P24","v":0},{"$f":"'15-03-15'!$P24","v":0},{"$f":"'25-03-12'!$P24","v":0},null,null,null,null,0,10]
[11,"MOJO WINE",{"$f":"'26-10-14'!$P25","v":0},{"$f":"'9-11-14'!$P25","v":0},{"$f":"'23-11-14'!$P25","v":0},{"$f":"'7-12-14'!$P25","v":0},{"$f":"'11-01-15'!$P25","v":0},{"$f":"'18-01-15'!$P25","v":0},{"$f":"'25-01-15'!$P25","v":0},{"$f":"'26-01-15'!$P25","v":0},{"$f":"'1-02-15'!P25","v":0},{"$f":"'8-03-15'!$P25","v":0},{"$f":"'15-03-15'!$P25","v":0},{"$f":"'25-03-12'!$P25","v":0},null,null,null,null,0,11]
[12,"LUMIX",{"$f":"'26-10-14'!$P26","v":0},{"$f":"'9-11-14'!$P26","v":0},{"$f":"'23-11-14'!$P26","v":0},{"$f":"'7-12-14'!$P26","v":0},{"$f":"'11-01-15'!$P26","v":0},{"$f":"'18-01-15'!$P26","v":0},{"$f":"'25-01-15'!$P26","v":0},{"$f":"'26-01-15'!$P26","v":0},{"$f":"'1-02-15'!P26","v":0},{"$f":"'8-03-15'!$P26","v":0},{"$f":"'15-03-15'!$P26","v":0},{"$f":"'25-03-12'!$P26","v":0},null,null,null,null,0,12]
[13,"COMPASSMARKETS.COM",{"$f":"'26-10-14'!$P27","v":0},{"$f":"'9-11-14'!$P27","v":0},{"$f":"'23-11-14'!$P27","v":0},{"$f":"'7-12-14'!$P27","v":0},{"$f":"'11-01-15'!$P27","v":0},{"$f":"'18-01-15'!$P27","v":0},{"$f":"'25-01-15'!$P27","v":0},{"$f":"'26-01-15'!$P27","v":0},{"$f":"'1-02-15'!P27","v":0},{"$f":"'8-03-15'!$P27","v":0},{"$f":"'15-03-15'!$P27","v":0},{"$f":"'25-03-12'!$P27","v":0},null,null,null,null,0,13]
[14,"THE KITCHEN MAKER",{"$f":"'26-10-14'!$P28","v":0},{"$f":"'9-11-14'!$P28","v":0},{"$f":"'23-11-14'!$P28","v":0},{"$f":"'7-12-14'!$P28","v":0},{"$f":"'11-01-15'!$P28","v":0},{"$f":"'18-01-15'!$P28","v":0},{"$f":"'25-01-15'!$P28","v":0},{"$f":"'26-01-15'!$P28","v":0},{"$f":"'1-02-15'!P28","v":0},{"$f":"'8-03-15'!$P28","v":0},{"$f":"'15-03-15'!$P28","v":0},{"$f":"'25-03-12'!$P28","v":0},null,null,null,null,0,14]
[15,"NOAKES SAILING",{"$f":"'26-10-14'!$P29","v":0},{"$f":"'9-11-14'!$P29","v":0},{"$f":"'23-11-14'!$P29","v":0},{"$f":"'7-12-14'!$P29","v":0},{"$f":"'11-01-15'!$P29","v":0},{"$f":"'18-01-15'!$P29","v":0},{"$f":"'25-01-15'!$P29","v":0},{"$f":"'26-01-15'!$P29","v":0},{"$f":"'1-02-15'!P29","v":0},{"$f":"'8-03-15'!$P29","v":0},{"$f":"'15-03-15'!$P29","v":0},{"$f":"'25-03-12'!$P29","v":0},null,null,null,null,0,15]
[16,"HAIER APPLIANCES",{"$f":"'26-10-14'!$P30","v":0},{"$f":"'9-11-14'!$P30","v":0},{"$f":"'23-11-14'!$P30","v":0},{"$f":"'7-12-14'!$P30","v":0},{"$f":"'11-01-15'!$P30","v":0},{"$f":"'18-01-15'!$P30","v":0},{"$f":"'25-01-15'!$P30","v":0},{"$f":"'26-01-15'!$P30","v":0},{"$f":"'1-02-15'!P30","v":0},{"$f":"'8-03-15'!$P30","v":0},{"$f":"'15-03-15'!$P30","v":0},{"$f":"'25-03-12'!$P30","v":0},null,null,null,null,0,16]
[17,"ILVE",{"$f":"'26-10-14'!$P31","v":0},{"$f":"'9-11-14'!$P31","v":0},{"$f":"'23-11-14'!$P31","v":0},{"$f":"'7-12-14'!$P31","v":0},{"$f":"'11-01-15'!$P31","v":0},{"$f":"'18-01-15'!$P31","v":0},{"$f":"'25-01-15'!$P31","v":0},{"$f":"'26-01-15'!$P31","v":0},{"$f":"'1-02-15'!P31","v":0},{"$f":"'8-03-15'!$P31","v":0},{"$f":"'15-03-15'!$P31","v":0},{"$f":"'25-03-12'!$P31","v":0},null,null,null,null,0,17]
[18,"VIAGOGO",300,{"$f":"'14-12-14'!$P32","v":0},{"$f":"'11-01-15'!$P32","v":0},{"$f":"'18-01-15'!$P32","v":0},{"$f":"'25-01-15'!$P32","v":0},{"$f":"'26-01-15'!$P32","v":0},{"$f":"'1-02-15'!$P32","v":0},{"$f":"'8-02-15'!$P32","v":0},{"$f":"'1-03-15'!P32","v":0},{"$f":"'8-03-15'!$P32","v":0},{"$f":"'22-03-15'!$P32","v":0},{"$f":"'25-03-12'!$P32","v":0},null,null,null,null,300,{"$f":"T20+1","v":18}]
[19,"ILVE",300,{"$f":"'14-12-14'!$P33","v":0},{"$f":"'11-01-15'!$P33","v":0},{"$f":"'18-01-15'!$P33","v":0},{"$f":"'25-01-15'!$P33","v":0},{"$f":"'26-01-15'!$P33","v":0},{"$f":"'1-02-15'!$P33","v":0},{"$f":"'8-02-15'!$P33","v":0},{"$f":"'1-03-15'!P33","v":0},{"$f":"'8-03-15'!$P33","v":0},{"$f":"'22-03-15'!$P33","v":0},{"$f":"'25-03-12'!$P33","v":0},null,null,null,null,300,19]
[21,null,300,{"$f":"'9-11-14'!$P35","v":0},{"$f":"'16-11-14'!$P35","v":0},{"$f":"'23-11-14'!$P35","v":0},{"$f":"'30-11-14'!$P35","v":0},{"$f":"'7-12-14'!$P35","v":0},{"$f":"'11-01-15'!$P35","v":0},{"$f":"'18-01-15'!$P35","v":0},null,{"$f":"'25-01-15'!$P35","v":0},{"$f":"'26-01-15'!$P35","v":0},{"$f":"'1-02-15'!$P35","v":0},{"$f":"'1-03-15'!$P35","v":0},{"$f":"'8-03-15'!$P35","v":0},{"$f":"'22-03-15'!$P35","v":0},{"$f":"'18-03-12'!$P35","v":0},300,20]
[22,null,300,{"$f":"'9-11-14'!$P36","v":0},{"$f":"'16-11-14'!$P36","v":0},{"$f":"'23-11-14'!$P36","v":0},{"$f":"'30-11-14'!$P36","v":0},{"$f":"'7-12-14'!$P36","v":0},{"$f":"'11-01-15'!$P36","v":0},{"$f":"'18-01-15'!$P36","v":0},null,{"$f":"'25-01-15'!$P36","v":0},{"$f":"'26-01-15'!$P36","v":0},{"$f":"'1-02-15'!$P36","v":0},{"$f":"'1-03-15'!$P36","v":0},{"$f":"'8-03-15'!$P36","v":0},{"$f":"'22-03-15'!$P36","v":0},{"$f":"'18-03-12'!$P36","v":0},300,21]
[23,null,300,{"$f":"'9-11-14'!$P37","v":0},{"$f":"'16-11-14'!$P37","v":0},{"$f":"'23-11-14'!$P37","v":0},{"$f":"'30-11-14'!$P37","v":0},{"$f":"'7-12-14'!$P37","v":0},{"$f":"'11-01-15'!$P37","v":0},{"$f":"'18-01-15'!$P37","v":0},null,{"$f":"'25-01-15'!$P37","v":0},{"$f":"'26-01-15'!$P37","v":0},{"$f":"'1-02-15'!$P37","v":0},{"$f":"'1-03-15'!$P37","v":0},{"$f":"'8-03-15'!$P37","v":0},{"$f":"'22-03-15'!$P37","v":0},{"$f":"'18-03-12'!$P37","v":0},300,22]
[null,null,300,null,null,null,null,null,null,null,null,null,null,null,null,null,null,null,300,23]
["Notes:"]
[]
[]
[]
[]
["AUSTRALIAN 18Ft League - 2014/15 Season Handicap Point Score"]
[null,null,{"$f":"'12-10-14'!G4","v":"2014-10-12"},{"$f":"'19-10-14'!G4","v":"2014-10-19"},{"$f":"'26-10-14'!$G4","v":"2014-10-26"},{"$f":"'2-11-14'!$G4","v":"2014-11-02"},{"$f":"'9-11-14'!$G4","v":"2014-11-09"},{"$f":"'16-11-14'!$G4","v":"2014-11-16"},{"$f":"'23-11-14'!$G4","v":"2014-11-23"},{"$f":"'30-11-14'!$G4","v":"2014-11-30"},{"$f":"'7-12-14'!$G4","v":"2014-12-07"},{"$f":"'14-12-14'!$G4","v":"2014-12-14"},{"$f":"'11-01-15'!$G4","v":"2015-01-11"},{"$f":"'18-01-15'!$G4","v":"2015-01-18"},{"$f":"'25-01-15'!$G4","v":"2015-01-25"},{"$f":"'26-01-15'!$G4","v":"2015-01-26"},{"$f":"'1-02-15'!$G4","v":"2015-02-01"},{"$f":"'8-02-15'!$G4","v":"2015-02-08"},{"$f":"'1-03-15'!$G4","v":"2015-03-01"},{"$f":"'8-03-15'!$G4","v":"2015-03-08"},{"$f":"'15-03-15'!$G4","v":"2015-03-15"},{"$f":"'22-03-15'!$G4","v":"2015-03-22"},{"$f":"'11-03-12'!$G4","v":"00:00:00"},{"$f":"'18-03-12'!$G4","v":"00:00:00"},{"$f":"'25-03-12'!$G4","v":"00:00:00"}]
["Recall","Name","R1","R2","R3","R4","R5","R6","R7","R8","R9","R10","R11","R12","R13","R14","R15","R16","R17","R18","R19","R20","R21","R22","R23","Total","POS"]
[1,"THURLOW FISHER LAWYERS",{"$f":"'12-10-14'!Q15","v":1},{"$f":"'19-10-14'!Q15","v":2},{"$f":"'26-10-14'!$Q15","v":0},{"$f":"'2-11-14'!$Q15","v":0},{"$f":"'9-11-14'!$Q15","v":0},{"$f":"'16-11-14'!$Q15","v":0},{"$f":"'23-11-14'!$Q15","v":0},{"$f":"'30-11-14'!$Q15","v":0},{"$f":"'7-12-14'!$Q15","v":0},{"$f":"'14-12-14'!$Q15","v":0},{"$f":"'11-01-15'!$Q15","v":0},{"$f":"'18-01-15'!$Q15","v":0},{"$f":"'25-01-15'!$Q15","v":0},{"$f":"'26-01-15'!$Q15","v":0},{"$f":"'1-02-15'!$Q15","v":0},{"$f":"'8-02-15'!$Q15","v":0},{"$f":"'1-03-15'!$Q15","v":0},{"$f":"'8-03-15'!$Q15","v":0},{"$f":"'15-03-15'!$Q15","v":0},{"$f":"'22-03-15'!$Q15","v":0},{"$f":"'11-03-12'!$Q15","v":0},{"$f":"'18-03-12'!$Q15","v":0},{"$f":"'25-03-12'!$Q15","v":0},{"$f":"SUM(C35:Y35)","v":3},1]
[7,"GOTTA LOVE IT 7",{"$f":"'12-10-14'!Q21","v":3},{"$f":"'19-10-14'!Q21","v":1},{"$f":"'26-10-14'!$Q21","v":0},{"$f":"'2-11-14'!$Q21","v":0},{"$f":"'9-11-14'!$Q21","v":0},{"$f":"'16-11-14'!$Q21","v":0},{"$f":"'23-11-14'!$Q21","v":0},{"$f":"'30-11-14'!$Q21","v":0},{"$f":"'7-12-14'!$Q21","v":0},{"$f":"'14-12-14'!$Q21","v":0},{"$f":"'11-01-15'!$Q21","v":0},{"$f":"'18-01-15'!$Q21","v":0},{"$f":"'25-01-15'!$Q21","v":0},{"$f":"'26-01-15'!$Q21","v":0},{"$f":"'1-02-15'!$Q21","v":0},{"$f":"'8-02-15'!$Q21","v":0},{"$f":"'1-03-15'!$Q21","v":0},{"$f":"'8-03-15'!$Q21","v":0},{"$f":"'15-03-15'!$Q21","v":0},{"$f":"'22-03-15'!$Q21","v":0},{"$f":"'11-03-12'!$Q21","v":0},{"$f":"'18-03-12'!$Q21","v":0},{"$f":"'25-03-12'!$Q21","v":0},4,2]
[3,"ASKO GORENJE",{"$f":"'12-10-14'!Q17","v":2},{"$f":"'19-10-14'!Q17","v":7},{"$f":"'26-10-14'!$Q17","v":0},{"$f":"'2-11-14'!$Q17","v":0},{"$f":"'9-11-14'!$Q17","v":0},{"$f":"'16-11-14'!$Q17","v":0},{"$f":"'23-11-14'!$Q17","v":0},{"$f":"'30-11-14'!$Q17","v":0},{"$f":"'7-12-14'!$Q17","v":0},{"$f":"'14-12-14'!$Q17","v":0},{"$f":"'11-01-15'!$Q17","v":0},{"$f":"'18-01-15'!$Q17","v":0},{"$f":"'25-01-15'!$Q17","v":0},{"$f":"'26-01-15'!$Q17","v":0},{"$f":"'1-02-15'!$Q17","v":0},{"$f":"'8-02-15'!$Q17","v":0},{"$f":"'1-03-15'!$Q17","v":0},{"$f":"'8-03-15'!$Q17","v":0},{"$f":"'15-03-15'!$Q17","v":0},{"$f":"'22-03-15'!$Q17","v":0},{"$f":"'11-03-12'!$Q17","v":0},{"$f":"'18-03-12'!$Q17","v":0},{"$f":"'25-03-12'!$Q17","v":0},9,3]
[6,"COOPERS 62-RAG & FAMISH HOTEL",{"$f":"'12-10-14'!Q20","v":7},{"$f":"'19-10-14'!Q20","v":3},{"$f":"'26-10-14'!$Q20","v":0},{"$f":"'2-11-14'!$Q20","v":0},{"$f":"'9-11-14'!$Q20","v":0},{"$f":"'16-11-14'!$Q20","v":0},{"$f":"'23-11-14'!$Q20","v":0},{"$f":"'30-11-14'!$Q20","v":0},{"$f":"'7-12-14'!$Q20","v":0},{"$f":"'14-12-14'!$Q20","v":0},{"$f":"'11-01-15'!$Q20","v":0},{"$f":"'18-01-15'!$Q20","v":0},{"$f":"'25-01-15'!$Q20","v":0},{"$f":"'26-01-15'!$Q20","v":0},{"$f":"'1-02-15'!$Q20","v":0},{"$f":"'8-02-15'!$Q20","v":0},{"$f":"'1-03-15'!$Q20","v":0},{"$f":"'8-03-15'!$Q20","v":0},{"$f":"'15-03-15'!$Q20","v":0},{"$f":"'22-03-15'!$Q20","v":0},{"$f":"'11-03-12'!$Q20","v":0},{"$f":"'18-03-12'!$Q20","v":0},{"$f":"'25-03-12'!$Q20","v":0},10,4]
[2,"YANDOO",{"$f":"'12-10-14'!Q16","v":8},{"$f":"'19-10-14'!Q16","v":4},{"$f":"'26-10-14'!$Q16","v":0},{"$f":"'2-11-14'!$Q16","v":0},{"$f":"'9-11-14'!$Q16","v":0},{"$f":"'16-11-14'!$Q16","v":0},{"$f":"'23-11-14'!$Q16","v":0},{"$f":"'30-11-14'!$Q16","v":0},{"$f":"'7-12-14'!$Q16","v":0},{"$f":"'14-12-14'!$Q16","v":0},{"$f":"'11-01-15'!$Q16","v":0},{"$f":"'18-01-15'!$Q16","v":0},{"$f":"'25-01-15'!$Q16","v":0},{"$f":"'26-01-15'!$Q16","v":0},{"$f":"'1-02-15'!$Q16","v":0},{"$f":"'8-02-15'!$Q16","v":0},{"$f":"'1-03-15'!$Q16","v":0},{"$f":"'8-03-15'!$Q16","v":0},{"$f":"'15-03-15'!$Q16","v":0},{"$f":"'22-03-15'!$Q16","v":0},{"$f":"'11-03-12'!$Q16","v":0},{"$f":"'18-03-12'!$Q16","v":0},{"$f":"'25-03-12'!$Q16","v":0},12,5]
[5,"APPLIANCESONLINE.COM.AU",{"$f":"'12-10-14'!Q19","v":6},{"$f":"'19-10-14'!Q19","v":6},{"$f":"'26-10-14'!$Q19","v":0},{"$f":"'2-11-14'!$Q19","v":0},{"$f":"'9-11-14'!$Q19","v":0},{"$f":"'16-11-14'!$Q19","v":0},{"$f":"'23-11-14'!$Q19","v":0},{"$f":"'30-11-14'!$Q19","v":0},{"$f":"'7-12-14'!$Q19","v":0},{"$f":"'14-12-14'!$Q19","v":0},{"$f":"'11-01-15'!$Q19","v":0},{"$f":"'18-01-15'!$Q19","v":0},{"$f":"'25-01-15'!$Q19","v":0},{"$f":"'26-01-15'!$Q19","v":0},{"$f":"'1-02-15'!$Q19","v":0},{"$f":"'8-02-15'!$Q19","v":0},{"$f":"'1-03-15'!$Q19","v":0},{"$f":"'8-03-15'!$Q19","v":0},{"$f":"'15-03-15'!$Q19","v":0},{"$f":"'22-03-15'!$Q19","v":0},{"$f":"'11-03-12'!$Q19","v":0},{"$f":"'18-03-12'!$Q19","v":0},{"$f":"'25-03-12'!$Q19","v":0},12,6]
[8,"SMEG",{"$f":"'12-10-14'!Q22","v":5},{"$f":"'19-10-14'!Q22","v":9},{"$f":"'26-10-14'!$Q22","v":0},{"$f":"'2-11-14'!$Q22","v":0},{"$f":"'9-11-14'!$Q22","v":0},{"$f":"'16-11-14'!$Q22","v":0},{"$f":"'23-11-14'!$Q22","v":0},{"$f":"'30-11-14'!$Q22","v":0},{"$f":"'7-12-14'!$Q22","v":0},{"$f":"'14-12-14'!$Q22","v":0},{"$f":"'11-01-15'!$Q22","v":0},{"$f":"'18-01-15'!$Q22","v":0},{"$f":"'25-01-15'!$Q22","v":0},{"$f":"'26-01-15'!$Q22","v":0},{"$f":"'1-02-15'!$Q22","v":0},{"$f":"'8-02-15'!$Q22","v":0},{"$f":"'1-03-15'!$Q22","v":0},{"$f":"'8-03-15'!$Q22","v":0},{"$f":"'15-03-15'!$Q22","v":0},{"$f":"'22-03-15'!$Q22","v":0},{"$f":"'11-03-12'!$Q22","v":0},{"$f":"'18-03-12'!$Q22","v":0},{"$f":"'25-03-12'!$Q22","v":0},14,7,null,null,null,null,null,null,null,null,null,{"$f":"AI41+AJ41","v":0}]
[11,"MOJO WINE",{"$f":"'12-10-14'!Q25","v":9},{"$f":"'19-10-14'!Q25","v":5},{"$f":"'26-10-14'!$Q25","v":0},{"$f":"'2-11-14'!$Q25","v":0},{"$f":"'9-11-14'!$Q25","v":0},{"$f":"'16-11-14'!$Q25","v":0},{"$f":"'23-11-14'!$Q25","v":0},{"$f":"'30-11-14'!$Q25","v":0},{"$f":"'7-12-14'!$Q25","v":0},{"$f":"'14-12-14'!$Q25","v":0},{"$f":"'11-01-15'!$Q25","v":0},{"$f":"'18-01-15'!$Q25","v":0},{"$f":"'25-01-15'!$Q25","v":0},{"$f":"'26-01-15'!$Q25","v":0},{"$f":"'1-02-15'!$Q25","v":0},{"$f":"'8-02-15'!$Q25","v":0},{"$f":"'1-03-15'!$Q25","v":0},{"$f":"'8-03-15'!$Q25","v":0},{"$f":"'15-03-15'!$Q25","v":0},{"$f":"'22-03-15'!$Q25","v":0},{"$f":"'11-03-12'!$Q25","v":0},{"$f":"'18-03-12'!$Q25","v":0},{"$f":"'25-03-12'!$Q25","v":0},14,8,null,null,null,null,null,null,null,null,null,{"$f":"AI42+AJ42","v":0}]
[13,"COMPASSMARKETS.COM",{"$f":"'12-10-14'!Q27","v":10},{"$f":"'19-10-14'!Q27","v":8},{"$f":"'26-10-14'!$Q27","v":0},{"$f":"'2-11-14'!$Q27","v":0},{"$f":"'9-11-14'!$Q27","v":0},{"$f":"'16-11-14'!$Q27","v":0},{"$f":"'23-11-14'!$Q27","v":0},{"$f":"'30-11-14'!$Q27","v":0},{"$f":"'7-12-14'!$Q27","v":0},{"$f":"'14-12-14'!$Q27","v":0},{"$f":"'11-01-15'!$Q27","v":0},{"$f":"'18-01-15'!$Q27","v":0},{"$f":"'25-01-15'!$Q27","v":0},{"$f":"'26-01-15'!$Q27","v":0},{"$f":"'1-02-15'!$Q27","v":0},{"$f":"'8-02-15'!$Q27","v":0},{"$f":"'1-03-15'!$Q27","v":0},{"$f":"'8-03-15'!$Q27","v":0},{"$f":"'15-03-15'!$Q27","v":0},{"$f":"'22-03-15'!$Q27","v":0},{"$f":"'11-03-12'!$Q27","v":0},{"$f":"'18-03-12'!$Q27","v":0},{"$f":"'25-03-12'!$Q27","v":0},18,9]
[12,"LUMIX",{"$f":"'12-10-14'!Q26","v":4},{"$f":"'19-10-14'!Q26","v":18},{"$f":"'26-10-14'!$Q26","v":0},{"$f":"'2-11-14'!$Q26","v":0},{"$f":"'9-11-14'!$Q26","v":0},{"$f":"'16-11-14'!$Q26","v":0},{"$f":"'23-11-14'!$Q26","v":0},{"$f":"'30-11-14'!$Q26","v":0},{"$f":"'7-12-14'!$Q26","v":0},{"$f":"'14-12-14'!$Q26","v":0},{"$f":"'11-01-15'!$Q26","v":0},{"$f":"'18-01-15'!$Q26","v":0},{"$f":"'25-01-15'!$Q26","v":0},{"$f":"'26-01-15'!$Q26","v":0},{"$f":"'1-02-15'!$Q26","v":0},{"$f":"'8-02-15'!$Q26","v":0},{"$f":"'1-03-15'!$Q26","v":0},{"$f":"'8-03-15'!$Q26","v":0},{"$f":"'15-03-15'!$Q26","v":0},{"$f":"'22-03-15'!$Q26","v":0},{"$f":"'11-03-12'!$Q26","v":0},{"$f":"'18-03-12'!$Q26","v":0},{"$f":"'25-03-12'!$Q26","v":0},22,10]
[10,"FISHER & PAYKEL",{"$f":"'12-10-14'!Q24","v":12},{"$f":"'19-10-14'!Q24","v":12},{"$f":"'26-10-14'!$Q24","v":0},{"$f":"'2-11-14'!$Q24","v":0},{"$f":"'9-11-14'!$Q24","v":0},{"$f":"'16-11-14'!$Q24","v":0},{"$f":"'23-11-14'!$Q24","v":0},{"$f":"'30-11-14'!$Q24","v":0},{"$f":"'7-12-14'!$Q24","v":0},{"$f":"'14-12-14'!$Q24","v":0},{"$f":"'11-01-15'!$Q24","v":0},{"$f":"'18-01-15'!$Q24","v":0},{"$f":"'25-01-15'!$Q24","v":0},{"$f":"'26-01-15'!$Q24","v":0},{"$f":"'1-02-15'!$Q24","v":0},{"$f":"'8-02-15'!$Q24","v":0},{"$f":"'1-03-15'!$Q24","v":0},{"$f":"'8-03-15'!$Q24","v":0},{"$f":"'15-03-15'!$Q24","v":0},{"$f":"'22-03-15'!$Q24","v":0},{"$f":"'11-03-12'!$Q24","v":0},{"$f":"'18-03-12'!$Q24","v":0},{"$f":"'25-03-12'!$Q24","v":0},24,11]
[4,"DE’LONGHI",{"$f":"'12-10-14'!Q18","v":18},{"$f":"'19-10-14'!Q18","v":10},{"$f":"'26-10-14'!$Q18","v":0},{"$f":"'2-11-14'!$Q18","v":0},{"$f":"'9-11-14'!$Q18","v":0},{"$f":"'16-11-14'!$Q18","v":0},{"$f":"'23-11-14'!$Q18","v":0},{"$f":"'30-11-14'!$Q18","v":0},{"$f":"'7-12-14'!$Q18","v":0},{"$f":"'14-12-14'!$Q18","v":0},{"$f":"'11-01-15'!$Q18","v":0},{"$f":"'18-01-15'!$Q18","v":0},{"$f":"'25-01-15'!$Q18","v":0},{"$f":"'26-01-15'!$Q18","v":0},{"$f":"'1-02-15'!$Q18","v":0},{"$f":"'8-02-15'!$Q18","v":0},{"$f":"'1-03-15'!$Q18","v":0},{"$f":"'8-03-15'!$Q18","v":0},{"$f":"'15-03-15'!$Q18","v":0},{"$f":"'22-03-15'!$Q18","v":0},{"$f":"'11-03-12'!$Q18","v":0},{"$f":"'18-03-12'!$Q18","v":0},{"$f":"'25-03-12'!$Q18","v":0},28,12]
[15,"NOAKES SAILING",{"$f":"'12-10-14'!Q29","v":11},{"$f":"'19-10-14'!Q29","v":18},{"$f":"'26-10-14'!$Q29","v":0},{"$f":"'2-11-14'!$Q29","v":0},{"$f":"'9-11-14'!$Q29","v":0},{"$f":"'16-11-14'!$Q29","v":0},{"$f":"'23-11-14'!$Q29","v":0},{"$f":"'30-11-14'!$Q29","v":0},{"$f":"'7-12-14'!$Q29","v":0},{"$f":"'14-12-14'!$Q29","v":0},{"$f":"'11-01-15'!$Q29","v":0},{"$f":"'18-01-15'!$Q29","v":0},{"$f":"'25-01-15'!$Q29","v":0},{"$f":"'26-01-15'!$Q29","v":0},{"$f":"'1-02-15'!$Q29","v":0},{"$f":"'8-02-15'!$Q29","v":0},{"$f":"'1-03-15'!$Q29","v":0},{"$f":"'8-03-15'!$Q29","v":0},{"$f":"'15-03-15'!$Q29","v":0},{"$f":"'22-03-15'!$Q29","v":0},{"$f":"'11-03-12'!$Q29","v":0},{"$f":"'18-03-12'!$Q29","v":0},{"$f":"'25-03-12'!$Q29","v":0},29,13]
[16,"HAIER APPLIANCES",{"$f":"'12-10-14'!Q30","v":18},{"$f":"'19-10-14'!Q30","v":11},{"$f":"'26-10-14'!$Q30","v":0},{"$f":"'2-11-14'!$Q30","v":0},{"$f":"'9-11-14'!$Q30","v":0},{"$f":"'16-11-14'!$Q30","v":0},{"$f":"'23-11-14'!$Q30","v":0},{"$f":"'30-11-14'!$Q30","v":0},{"$f":"'7-12-14'!$Q30","v":0},{"$f":"'14-12-14'!$Q30","v":0},{"$f":"'11-01-15'!$Q30","v":0},{"$f":"'18-01-15'!$Q30","v":0},{"$f":"'25-01-15'!$Q30","v":0},{"$f":"'26-01-15'!$Q30","v":0},{"$f":"'1-02-15'!$Q30","v":0},{"$f":"'8-02-15'!$Q30","v":0},{"$f":"'1-03-15'!$Q30","v":0},{"$f":"'8-03-15'!$Q30","v":0},{"$f":"'15-03-15'!$Q30","v":0},{"$f":"'22-03-15'!$Q30","v":0},{"$f":"'11-03-12'!$Q30","v":0},{"$f":"'18-03-12'!$Q30","v":0},{"$f":"'25-03-12'!$Q30","v":0},29,14]
[17,"ILVE",{"$f":"'12-10-14'!Q31","v":13},{"$f":"'19-10-14'!Q31","v":18},{"$f":"'26-10-14'!$Q31","v":0},{"$f":"'2-11-14'!$Q31","v":0},{"$f":"'9-11-14'!$Q31","v":0},{"$f":"'16-11-14'!$Q31","v":0},{"$f":"'23-11-14'!$Q31","v":0},{"$f":"'30-11-14'!$Q31","v":0},{"$f":"'7-12-14'!$Q31","v":0},{"$f":"'14-12-14'!$Q31","v":0},{"$f":"'11-01-15'!$Q31","v":0},{"$f":"'18-01-15'!$Q31","v":0},{"$f":"'25-01-15'!$Q31","v":0},{"$f":"'26-01-15'!$Q31","v":0},{"$f":"'1-02-15'!$Q31","v":0},{"$f":"'8-02-15'!$Q31","v":0},{"$f":"'1-03-15'!$Q31","v":0},{"$f":"'8-03-15'!$Q31","v":0},{"$f":"'15-03-15'!$Q31","v":0},{"$f":"'22-03-15'!$Q31","v":0},{"$f":"'11-03-12'!$Q31","v":0},{"$f":"'18-03-12'!$Q31","v":0},{"$f":"'25-03-12'!$Q31","v":0},31,15]
[9,"PURE BLONDE",{"$f":"'12-10-14'!Q23","v":18},{"$f":"'19-10-14'!Q23","v":18},{"$f":"'26-10-14'!$Q23","v":0},{"$f":"'2-11-14'!$Q23","v":0},{"$f":"'9-11-14'!$Q23","v":0},{"$f":"'16-11-14'!$Q23","v":0},{"$f":"'23-11-14'!$Q23","v":0},{"$f":"'30-11-14'!$Q23","v":0},{"$f":"'7-12-14'!$Q23","v":0},{"$f":"'14-12-14'!$Q23","v":0},{"$f":"'11-01-15'!$Q23","v":0},{"$f":"'18-01-15'!$Q23","v":0},{"$f":"'25-01-15'!$Q23","v":0},{"$f":"'26-01-15'!$Q23","v":0},{"$f":"'1-02-15'!$Q23","v":0},{"$f":"'8-02-15'!$Q23","v":0},{"$f":"'1-03-15'!$Q23","v":0},{"$f":"'8-03-15'!$Q23","v":0},{"$f":"'15-03-15'!$Q23","v":0},{"$f":"'22-03-15'!$Q23","v":0},{"$f":"'11-03-12'!$Q23","v":0},{"$f":"'18-03-12'!$Q23","v":0},{"$f":"'25-03-12'!$Q23","v":0},36,16]
[14,"THE KITCHEN MAKER",{"$f":"'12-10-14'!Q28","v":18},{"$f":"'19-10-14'!Q28","v":18},{"$f":"'26-10-14'!$Q28","v":0},{"$f":"'2-11-14'!$Q28","v":0},{"$f":"'9-11-14'!$Q28","v":0},{"$f":"'16-11-14'!$Q28","v":0},{"$f":"'23-11-14'!$Q28","v":0},{"$f":"'30-11-14'!$Q28","v":0},{"$f":"'7-12-14'!$Q28","v":0},{"$f":"'14-12-14'!$Q28","v":0},{"$f":"'11-01-15'!$Q28","v":0},{"$f":"'18-01-15'!$Q28","v":0},{"$f":"'25-01-15'!$Q28","v":0},{"$f":"'26-01-15'!$Q28","v":0},{"$f":"'1-02-15'!$Q28","v":0},{"$f":"'8-02-15'!$Q28","v":0},{"$f":"'1-03-15'!$Q28","v":0},{"$f":"'8-03-15'!$Q28","v":0},{"$f":"'15-03-15'!$Q28","v":0},{"$f":"'22-03-15'!$Q28","v":0},{"$f":"'11-03-12'!$Q28","v":0},{"$f":"'18-03-12'!$Q28","v":0},{"$f":"'25-03-12'!$Q28","v":0},36,17]
[18,"VIAGOGO",{"$f":"'12-10-14'!Q32","v":18},{"$f":"'19-10-14'!Q32","v":18},{"$f":"'26-10-14'!$Q32","v":0},{"$f":"'2-11-14'!$Q32","v":0},{"$f":"'9-11-14'!$Q32","v":0},{"$f":"'16-11-14'!$Q32","v":0},{"$f":"'23-11-14'!$Q32","v":0},{"$f":"'30-11-14'!$Q32","v":0},{"$f":"'7-12-14'!$Q32","v":0},{"$f":"'14-12-14'!$Q32","v":0},{"$f":"'11-01-15'!$Q32","v":0},{"$f":"'18-01-15'!$Q32","v":0},{"$f":"'25-01-15'!$Q32","v":0},{"$f":"'26-01-15'!$Q32","v":0},{"$f":"'1-02-15'!$Q32","v":0},{"$f":"'8-02-15'!$Q32","v":0},{"$f":"'1-03-15'!$Q32","v":0},{"$f":"'8-03-15'!$Q32","v":0},{"$f":"'15-03-15'!$Q32","v":0},{"$f":"'22-03-15'!$Q32","v":0},{"$f":"'11-03-12'!$Q32","v":0},{"$f":"'18-03-12'!$Q32","v":0},{"$f":"'25-03-12'!$Q32","v":0},36,18]
[19,"ILVE",{"$f":"'12-10-14'!Q33","v":18},{"$f":"'19-10-14'!Q33","v":18},{"$f":"'26-10-14'!$Q33","v":0},{"$f":"'2-11-14'!$Q33","v":0},{"$f":"'9-11-14'!$Q33","v":0},{"$f":"'16-11-14'!$Q33","v":0},{"$f":"'23-11-14'!$Q33","v":0},{"$f":"'30-11-14'!$Q33","v":0},{"$f":"'7-12-14'!$Q33","v":0},{"$f":"'14-12-14'!$Q33","v":0},{"$f":"'11-01-15'!$Q33","v":0},{"$f":"'18-01-15'!$Q33","v":0},{"$f":"'25-01-15'!$Q33","v":0},{"$f":"'26-01-15'!$Q33","v":0},{"$f":"'1-02-15'!$Q33","v":0},{"$f":"'8-02-15'!$Q33","v":0},{"$f":"'1-03-15'!$Q33","v":0},{"$f":"'8-03-15'!$Q33","v":0},{"$f":"'15-03-15'!$Q33","v":0},{"$f":"'22-03-15'!$Q33","v":0},{"$f":"'11-03-12'!$Q33","v":0},{"$f":"'18-03-12'!$Q33","v":0},{"$f":"'25-03-12'!$Q33","v":0},36,19,null,null,null,null,null,null,null,"NB These cells have white forground to hide data"]
[22,null,{"$f":"'12-10-14'!Q34","v":18},{"$f":"'19-10-14'!Q34","v":18},{"$f":"'26-10-14'!$Q34","v":0},{"$f":"'2-11-14'!$Q34","v":0},{"$f":"'9-11-14'!$Q34","v":0},{"$f":"'16-11-14'!$Q34","v":0},{"$f":"'23-11-14'!$Q34","v":0},{"$f":"'30-11-14'!$Q34","v":0},{"$f":"'7-12-14'!$Q34","v":0},{"$f":"'14-12-14'!$Q34","v":0},{"$f":"'11-01-15'!$Q34","v":0},{"$f":"'18-01-15'!$Q34","v":0},{"$f":"'25-01-15'!$Q34","v":0},{"$f":"'26-01-15'!$Q34","v":0},{"$f":"'1-02-15'!$Q34","v":0},{"$f":"'8-02-15'!$Q34","v":0},{"$f":"'1-03-15'!$Q34","v":0},{"$f":"'8-03-15'!$Q34","v":0},{"$f":"'15-03-15'!$Q34","v":0},{"$f":"'22-03-15'!$Q34","v":0},{"$f":"'11-03-12'!$Q37","v":0},{"$f":"'18-03-12'!$Q37","v":0},{"$f":"'25-03-12'!$Q28","v":0},null,20]
[23,null,{"$f":"'12-10-14'!Q35","v":18},{"$f":"'19-10-14'!Q35","v":18},{"$f":"'26-10-14'!$Q35","v":0},{"$f":"'2-11-14'!$Q35","v":0},{"$f":"'9-11-14'!$Q35","v":0},{"$f":"'16-11-14'!$Q35","v":0},{"$f":"'23-11-14'!$Q35","v":0},{"$f":"'30-11-14'!$Q35","v":0},{"$f":"'7-12-14'!$Q35","v":0},{"$f":"'14-12-14'!$Q35","v":0},{"$f":"'11-01-15'!$Q35","v":0},{"$f":"'18-01-15'!$Q35","v":0},{"$f":"'25-01-15'!$Q35","v":0},{"$f":"'26-01-15'!$Q35","v":0},{"$f":"'1-02-15'!$Q35","v":0},{"$f":"'8-02-15'!$Q35","v":0},{"$f":"'1-03-15'!$Q35","v":0},{"$f":"'8-03-15'!$Q35","v":0},{"$f":"'15-03-15'!$Q35","v":0},{"$f":"'22-03-15'!$Q35","v":0},{"$f":"'11-03-12'!$Q36","v":0},{"$f":"'18-03-12'!$Q36","v":0},{"$f":"'25-03-12'!$Q37","v":0},null,21]
[null,null,null,null,null,null,null,null,null,null,null,null,null,null,null,null,null,null,null,null,null,null,null,null,null,null,22]
[null,null,null,null,null,null,{"$f":"'9-11-14'!$Q32","v":0},{"$f":"'16-11-14'!$Q32","v":0},{"$f":"'23-11-14'!$Q32","v":0},{"$f":"'30-11-14'!$Q32","v":0},{"$f":"'7-12-14'!$Q32","v":0},{"$f":"'14-12-14'!$Q32","v":0},{"$f":"'11-01-15'!$Q32","v":0},{"$f":"'18-01-15'!$Q32","v":0},{"$f":"'25-01-15'!$Q32","v":0},{"$f":"'26-01-15'!$Q32","v":0},{"$f":"'1-02-15'!$Q32","v":0},{"$f":"'8-02-15'!$Q32","v":0},{"$f":"'1-03-15'!$Q32","v":0},{"$f":"'8-03-15'!$Q32","v":0},{"$f":"'15-03-15'!$Q32","v":0},{"$f":"'22-03-15'!$Q32","v":0},{"$f":"'11-03-12'!$Q32","v":0},{"$f":"'18-03-12'!$Q32","v":0},{"$f":"'25-03-12'!$Q38","v":0},null,23]
[]
[]
[]
["AUSTRALIAN 18Ft League - 2013/14 - 3 Buoy Challenge Point Score"]
[null,null,{"$f":"'12-10-14'!G4","v":"2014-10-12"},{"$f":"'19-10-14'!$G4","v":"2014-10-19"},{"$f":"'26-10-14'!$G4","v":"2014-10-26"},{"$f":"'2-11-14'!$G4","v":"2014-11-02"},{"$f":"'16-11-14'!$G4","v":"2014-11-16"},{"$f":"'23-11-14'!$G4","v":"2014-11-23"},{"$f":"'30-11-14'!$G4","v":"2014-11-30"},{"$f":"'7-12-14'!$G4","v":"2014-12-07"},1,"Drop"]
["Recall","Name","R1","R2","R3","R4","R5","R6","R7","R8","Total","Total","POS"]
[11,"MOJO WINE",{"$f":"IF('12-10-14'!Q25=20,20,'12-10-14'!Q25)","v":9},{"$f":"IF('19-10-14'!$Q25=20,20,'19-10-14'!$Q25)","v":5},{"$f":"IF('26-10-14'!$Q25=20,20,'26-10-14'!$Q25)","v":0},{"$f":"IF('2-11-14'!$Q25=20,20,'2-11-14'!$Q25)","v":0},{"$f":"IF('16-11-14'!$Q25=20,20,'16-11-14'!$Q25)","v":0},{"$f":"IF('23-11-14'!$Q25=20,20,'23-11-14'!$Q25)","v":0},{"$f":"IF('30-11-14'!$Q25=20,20,'30-11-14'!$Q25)","v":0},{"$f":"'7-12-14'!$Q25","v":0},{"$f":"SUM(C64:J64)","v":14},{"$f":"IF(K$62=1,SUM(C64:J64)-MAX(C64:J64),SUM(C64:J64))","v":5},1]
[2,"YANDOO",{"$f":"(SUM(D65:J65)-MAX(D65:J65))/(COUNTIF(D65:J65,\">0\")-1)","v":{"$error":"#DIV/0!"}},{"$f":"IF('19-10-14'!$Q16=20,20,'19-10-14'!$Q16)","v":4},{"$f":"IF('26-10-14'!$Q16=20,20,'26-10-14'!$Q16)","v":0},{"$f":"IF('2-11-14'!$Q16=20,20,'2-11-14'!$Q16)","v":0},{"$f":"IF('16-11-14'!$Q16=20,20,'16-11-14'!$Q16)","v":0},{"$f":"IF('23-11-14'!$Q16=20,20,'23-11-14'!$Q16)","v":0},{"$f":"IF('30-11-14'!$Q16=20,20,'30-11-14'!$Q16)","v":0},{"$f":"'7-12-14'!$Q16","v":0},{"$error":"#DIV/0!"},{"$error":"#DIV/0!"},2]
[13,"RABBITOHS-KENWOOD",{"$f":"IF('12-10-14'!Q27=20,20,'12-10-14'!Q27)","v":10},{"$f":"IF('19-10-14'!$Q27=20,20,'19-10-14'!$Q27)","v":8},{"$f":"IF('26-10-14'!$Q27=20,20,'26-10-14'!$Q27)","v":0},{"$f":"IF('2-11-14'!$Q27=20,20,'2-11-14'!$Q27)","v":0},{"$f":"IF('16-11-14'!$Q27=20,20,'16-11-14'!$Q27)","v":0},{"$f":"IF('23-11-14'!$Q27=20,20,'23-11-14'!$Q27)","v":0},{"$f":"IF('30-11-14'!$Q27=20,20,'30-11-14'!$Q27)","v":0},{"$f":"'7-12-14'!$Q27","v":0},18,8,3]
[8,"SMEG",{"$f":"IF('12-10-14'!Q22=20,20,'12-10-14'!Q22)","v":5},{"$f":"IF('19-10-14'!$Q22=20,20,'19-10-14'!$Q22)","v":9},{"$f":"IF('26-10-14'!$Q22=20,20,'26-10-14'!$Q22)","v":0},{"$f":"IF('2-11-14'!$Q22=20,20,'2-11-14'!$Q22)","v":0},{"$f":"IF('16-11-14'!$Q22=20,20,'16-11-14'!$Q22)","v":0},{"$f":"IF('23-11-14'!$Q22=20,20,'23-11-14'!$Q22)","v":0},{"$f":"IF('30-11-14'!$Q22=20,20,'30-11-14'!$Q22)","v":0},{"$f":"'7-12-14'!$Q22","v":0},14,5,4]
[10,"FISHER & PAYKEL",{"$f":"(SUM(D68:J68)-MAX(D68:J68))/(COUNTIF(D68:J68,\">0\")-1)","v":{"$error":"#DIV/0!"}},{"$f":"IF('19-10-14'!$Q24=20,20,'19-10-14'!$Q24)","v":12},{"$f":"IF('26-10-14'!$Q24=20,20,'26-10-14'!$Q24)","v":0},{"$f":"IF('2-11-14'!$Q24=20,20,'2-11-14'!$Q24)","v":0},{"$f":"IF('16-11-14'!$Q24=20,20,'16-11-14'!$Q24)","v":0},{"$f":"IF('23-11-14'!$Q24=20,20,'23-11-14'!$Q24)","v":0},{"$f":"IF('30-11-14'!$Q24=20,20,'30-11-14'!$Q24)","v":0},{"$f":"'7-12-14'!$Q24","v":0},{"$error":"#DIV/0!"},{"$error":"#DIV/0!"},5]
[1,"THURLOW FISHER LAWYERS",{"$f":"IF('12-10-14'!Q15=20,20,'12-10-14'!Q15)","v":1},{"$f":"IF('19-10-14'!$Q15=20,20,'19-10-14'!$Q15)","v":2},{"$f":"IF('26-10-14'!$Q15=20,20,'26-10-14'!$Q15)","v":0},{"$f":"IF('2-11-14'!$Q15=20,20,'2-11-14'!$Q15)","v":0},{"$f":"IF('16-11-14'!$Q15=20,20,'16-11-14'!$Q15)","v":0},{"$f":"IF('23-11-14'!$Q15=20,20,'23-11-14'!$Q15)","v":0},{"$f":"IF('30-11-14'!$Q15=20,20,'30-11-14'!$Q15)","v":0},{"$f":"'7-12-14'!$Q15","v":0},3,1,6]
[12,"LUMIX",{"$f":"IF('12-10-14'!Q26=20,20,'12-10-14'!Q26)","v":4},{"$f":"IF('19-10-14'!$Q26=20,20,'19-10-14'!$Q26)","v":18},{"$f":"IF('26-10-14'!$Q26=20,20,'26-10-14'!$Q26)","v":0},{"$f":"IF('2-11-14'!$Q26=20,20,'2-11-14'!$Q26)","v":0},{"$f":"IF('16-11-14'!$Q26=20,20,'16-11-14'!$Q26)","v":0},{"$f":"IF('23-11-14'!$Q26=20,20,'23-11-14'!$Q26)","v":0},{"$f":"IF('30-11-14'!$Q26=20,20,'30-11-14'!$Q26)","v":0},{"$f":"'7-12-14'!$Q26","v":0},22,4,7]
[4,"DE’LONGHI-RABBITOHS",{"$f":"IF('12-10-14'!Q18=20,20,'12-10-14'!Q18)","v":18},{"$f":"IF('19-10-14'!$Q18=20,20,'19-10-14'!$Q18)","v":10},{"$f":"IF('26-10-14'!$Q18=20,20,'26-10-14'!$Q18)","v":0},{"$f":"IF('2-11-14'!$Q18=20,20,'2-11-14'!$Q18)","v":0},{"$f":"IF('16-11-14'!$Q18=20,20,'16-11-14'!$Q18)","v":0},{"$f":"IF('23-11-14'!$Q18=20,20,'23-11-14'!$Q18)","v":0},{"$f":"IF('30-11-14'!$Q18=20,20,'30-11-14'!$Q18)","v":0},{"$f":"'7-12-14'!$Q18","v":0},28,10,8]
[3,"ASKO APPLIANCES",{"$f":"IF('12-10-14'!Q17=20,20,'12-10-14'!Q17)","v":2},{"$f":"IF('19-10-14'!$Q17=20,20,'19-10-14'!$Q17)","v":7},{"$f":"IF('26-10-14'!$Q17=20,20,'26-10-14'!$Q17)","v":0},{"$f":"IF('2-11-14'!$Q17=20,20,'2-11-14'!$Q17)","v":0},{"$f":"IF('16-11-14'!$Q17=20,20,'16-11-14'!$Q17)","v":0},{"$f":"IF('23-11-14'!$Q17=20,20,'23-11-14'!$Q17)","v":0},{"$f":"IF('30-11-14'!$Q17=20,20,'30-11-14'!$Q17)","v":0},{"$f":"'7-12-14'!$Q17","v":0},9,2,9]
[6,"COOPERS 62-RAG & FAMISH HOTEL",{"$f":"IF('12-10-14'!Q20=20,20,'12-10-14'!Q20)","v":7},{"$f":"IF('19-10-14'!$Q20=20,20,'19-10-14'!$Q20)","v":3},{"$f":"IF('26-10-14'!$Q20=20,20,'26-10-14'!$Q20)","v":0},{"$f":"IF('2-11-14'!$Q20=20,20,'2-11-14'!$Q20)","v":0},{"$f":"IF('16-11-14'!$Q20=20,20,'16-11-14'!$Q20)","v":0},{"$f":"IF('23-11-14'!$Q20=20,20,'23-11-14'!$Q20)","v":0},{"$f":"IF('30-11-14'!$Q20=20,20,'30-11-14'!$Q20)","v":0},{"$f":"'7-12-14'!$Q20","v":0},10,3,10]
[14,"THE KITCHEN MAKER",{"$f":"IF('12-10-14'!Q28=20,20,'12-10-14'!Q28)","v":18},{"$f":"IF('19-10-14'!$Q28=20,20,'19-10-14'!$Q28)","v":18},{"$f":"IF('26-10-14'!$Q28=20,20,'26-10-14'!$Q28)","v":0},{"$f":"IF('2-11-14'!$Q28=20,20,'2-11-14'!$Q28)","v":0},{"$f":"IF('16-11-14'!$Q28=20,20,'16-11-14'!$Q28)","v":0},{"$f":"IF('23-11-14'!$Q28=20,20,'23-11-14'!$Q28)","v":0},{"$f":"IF('30-11-14'!$Q28=20,20,'30-11-14'!$Q28)","v":0},{"$f":"'7-12-14'!$Q28","v":0},36,18,11]
[15,"HAIER APPLIANCES",{"$f":"IF('12-10-14'!Q29=20,20,'12-10-14'!Q29)","v":11},{"$f":"IF('19-10-14'!$Q29=20,20,'19-10-14'!$Q29)","v":18},{"$f":"IF('26-10-14'!$Q29=20,20,'26-10-14'!$Q29)","v":0},{"$f":"IF('2-11-14'!$Q29=20,20,'2-11-14'!$Q29)","v":0},{"$f":"IF('16-11-14'!$Q29=20,20,'16-11-14'!$Q29)","v":0},{"$f":"IF('23-11-14'!$Q29=20,20,'23-11-14'!$Q29)","v":0},{"$f":"IF('30-11-14'!$Q29=20,20,'30-11-14'!$Q29)","v":0},{"$f":"'7-12-14'!$Q29","v":0},29,11,12]
[16,"SYDNEY CITY MARINE",{"$f":"IF('12-10-14'!Q30=20,20,'12-10-14'!Q30)","v":18},{"$f":"IF('19-10-14'!$Q30=20,20,'19-10-14'!$Q30)","v":11},{"$f":"IF('26-10-14'!$Q30=20,20,'26-10-14'!$Q30)","v":0},{"$f":"IF('2-11-14'!$Q30=20,20,'2-11-14'!$Q30)","v":0},{"$f":"IF('16-11-14'!$Q30=20,20,'16-11-14'!$Q30)","v":0},{"$f":"IF('23-11-14'!$Q30=20,20,'23-11-14'!$Q30)","v":0},{"$f":"IF('30-11-14'!$Q30=20,20,'30-11-14'!$Q30)","v":0},{"$f":"'7-12-14'!$Q30","v":0},29,11,13]
[5,"APPLIANCESONLINE.COM.AU",{"$f":"IF('12-10-14'!Q19=20,20,'12-10-14'!Q19)","v":6},{"$f":"IF('19-10-14'!$Q19=20,20,'19-10-14'!$Q19)","v":6},{"$f":"IF('26-10-14'!$Q19=20,20,'26-10-14'!$Q19)","v":0},{"$f":"IF('2-11-14'!$Q19=20,20,'2-11-14'!$Q19)","v":0},{"$f":"IF('16-11-14'!$Q19=20,20,'16-11-14'!$Q19)","v":0},{"$f":"IF('23-11-14'!$Q19=20,20,'23-11-14'!$Q19)","v":0},{"$f":"IF('30-11-14'!$Q19=20,20,'30-11-14'!$Q19)","v":0},{"$f":"'7-12-14'!$Q19","v":0},12,6,14]
[9,"PURE BLONDE",{"$f":"IF('12-10-14'!Q23=20,20,'12-10-14'!Q23)","v":18},{"$f":"IF('19-10-14'!$Q23=20,20,'19-10-14'!$Q23)","v":18},{"$f":"IF('26-10-14'!$Q23=20,20,'26-10-14'!$Q23)","v":0},{"$f":"IF('2-11-14'!$Q23=20,20,'2-11-14'!$Q23)","v":0},{"$f":"IF('16-11-14'!$Q23=20,20,'16-11-14'!$Q23)","v":0},{"$f":"IF('23-11-14'!$Q23=20,20,'23-11-14'!$Q23)","v":0},{"$f":"IF('30-11-14'!$Q23=20,20,'30-11-14'!$Q23)","v":0},{"$f":"'7-12-14'!$Q23","v":0},36,18,15]
[19,"ILVE",{"$f":"IF('12-10-14'!Q33=20,20,'12-10-14'!Q33)","v":18},{"$f":"IF('19-10-14'!$Q33=20,20,'19-10-14'!$Q33)","v":18},{"$f":"IF('26-10-14'!$Q33=20,20,'26-10-14'!$Q33)","v":0},{"$f":"IF('2-11-14'!$Q33=20,20,'2-11-14'!$Q33)","v":0},{"$f":"IF('16-11-14'!$Q33=20,20,'16-11-14'!$Q33)","v":0},{"$f":"IF('23-11-14'!$Q33=20,20,'23-11-14'!$Q33)","v":0},{"$f":"IF('30-11-14'!$Q33=20,20,'30-11-14'!$Q33)","v":0},{"$f":"'7-12-14'!$Q33","v":0},36,18,16]
[7,"GOTTA LOVE IT 7",{"$f":"IF('12-10-14'!Q21=20,20,'12-10-14'!Q21)","v":3},{"$f":"IF('19-10-14'!$Q21=20,20,'19-10-14'!$Q21)","v":1},{"$f":"IF('26-10-14'!$Q21=20,20,'26-10-14'!$Q21)","v":0},{"$f":"IF('2-11-14'!$Q21=20,20,'2-11-14'!$Q21)","v":0},{"$f":"IF('16-11-14'!$Q21=20,20,'16-11-14'!$Q21)","v":0},{"$f":"IF('23-11-14'!$Q21=20,20,'23-11-14'!$Q21)","v":0},{"$f":"IF('30-11-14'!$Q21=20,20,'30-11-14'!$Q21)","v":0},{"$f":"'7-12-14'!$Q21","v":0},4,1,17]
[17,"COMPASSFOREX.COM.AU",{"$f":"IF('12-10-14'!Q31=20,20,'12-10-14'!Q31)","v":13},{"$f":"IF('19-10-14'!$Q31=20,20,'19-10-14'!$Q31)","v":18},{"$f":"IF('26-10-14'!$Q31=20,20,'26-10-14'!$Q31)","v":0},{"$f":"IF('2-11-14'!$Q31=20,20,'2-11-14'!$Q31)","v":0},{"$f":"IF('16-11-14'!$Q31=20,20,'16-11-14'!$Q31)","v":0},{"$f":"IF('23-11-14'!$Q31=20,20,'23-11-14'!$Q31)","v":0},{"$f":"IF('30-11-14'!$Q31=20,20,'30-11-14'!$Q31)","v":0},{"$f":"'7-12-14'!$Q31","v":0},31,13,18]
[18,"VIAGOGO",{"$f":"IF('12-10-14'!Q32=20,20,'12-10-14'!Q32)","v":18},{"$f":"IF('19-10-14'!$Q32=20,20,'19-10-14'!$Q32)","v":18},{"$f":"IF('26-10-14'!$Q32=20,20,'26-10-14'!$Q32)","v":0},{"$f":"IF('2-11-14'!$Q32=20,20,'2-11-14'!$Q32)","v":0},{"$f":"IF('16-11-14'!$Q32=20,20,'16-11-14'!$Q32)","v":0},{"$f":"IF('23-11-14'!$Q32=20,20,'23-11-14'!$Q32)","v":0},{"$f":"IF('30-11-14'!$Q32=20,20,'30-11-14'!$Q32)","v":0},{"$f":"'7-12-14'!$Q32","v":0},36,18,19]
[20,null,{"$f":"'19-10-14'!Q63","v":0},{"$f":"'26-10-14'!$Q63","v":0},{"$f":"'2-11-14'!$Q63","v":0},{"$f":"'9-11-14'!$Q63","v":0},{"$f":"'16-11-14'!$Q63","v":0},{"$f":"'9-11-14'!$Q63","v":0},{"$f":"'16-11-14'!$Q63","v":0},{"$f":"'14-12-14'!$Q34","v":0},{"$f":"SUM(F83:J83)","v":0},null,20]
[22,null,{"$f":"'19-10-14'!Q65","v":0},{"$f":"'26-10-14'!$Q65","v":0},{"$f":"'2-11-14'!$Q65","v":0},{"$f":"'9-11-14'!$Q65","v":0},{"$f":"'16-11-14'!$Q65","v":0},{"$f":"'9-11-14'!$Q65","v":0},{"$f":"'16-11-14'!$Q65","v":0},{"$f":"'14-12-14'!$Q35","v":0},{"$f":"SUM(F84:J84)","v":0},null,21]
[23,null,{"$f":"'19-10-14'!Q64","v":0},{"$f":"'26-10-14'!$Q64","v":0},{"$f":"'2-11-14'!$Q64","v":0},{"$f":"'9-11-14'!$Q64","v":0},{"$f":"'16-11-14'!$Q64","v":0},{"$f":"'9-11-14'!$Q64","v":0},{"$f":"'16-11-14'!$Q64","v":0},{"$f":"'14-12-14'!$Q36","v":0},{"$f":"SUM(F85:J85)","v":0},null,22]
[null,null,null,null,null,{"$f":"'9-11-14'!$Q61","v":0},{"$f":"'16-11-14'!$Q61","v":0},{"$f":"'9-11-14'!$Q61","v":0},{"$f":"'16-11-14'!$Q61","v":0},{"$f":"'14-12-14'!$Q61","v":0},{"$f":"SUM(F86:J86)","v":0},null,23]
["Notes:","YANDO, Fisher & Paykel receive Av points  for Race 1, based on other their 5 best results. Boats still in transit at time."]
[]
[]
["AUSTRALIAN 18Ft Skiff - 2014/15 NSW Championship Pointscore"]
[null,"Best 4 results will count.",{"$f":"'9-11-14'!$G4","v":"2014-11-09"},{"$f":"'14-12-14'!$G4","v":"2014-12-14"},{"$f":"'25-01-15'!$G4","v":"2015-01-25"},{"$f":"'8-02-15'!$G4","v":"2015-02-08"},{"$f":"'1-03-15'!$G4","v":"2015-03-01"},0,"Drop"]
["Recall #","Name","R1","R2","R3","R4","R5","Total","Total","POS"]
[1,"THURLOW FISHER LAWYERS",{"$f":"'9-11-14'!$P15","v":0},{"$f":"'14-12-14'!$P15","v":0},{"$f":"'25-01-15'!$P15","v":0},{"$f":"'8-02-15'!$P15","v":0},{"$f":"'1-03-15'!$P15","v":0},{"$f":"SUM(C93:G93)","v":0},{"$f":"IF(H$91=1,SUM(C93:G93)-MAX(C93:G93),SUM(C93:G93))","v":0},1]
[2,"YANDOO",{"$f":"'9-11-14'!$P16","v":0},{"$f":"'14-12-14'!$P16","v":0},{"$f":"'25-01-15'!$P16","v":0},{"$f":"'8-02-15'!$P16","v":0},{"$f":"'1-03-15'!$P16","v":0},0,0,2]
[3,"ASKO GORENJE",{"$f":"'9-11-14'!$P17","v":0},{"$f":"'14-12-14'!$P17","v":0},{"$f":"'25-01-15'!$P17","v":0},{"$f":"'8-02-15'!$P17","v":0},{"$f":"'1-03-15'!$P17","v":0},0,0,3]
[4,"DE’LONGHI",{"$f":"'9-11-14'!$P18","v":0},{"$f":"'14-12-14'!$P18","v":0},{"$f":"'25-01-15'!$P18","v":0},{"$f":"'8-02-15'!$P18","v":0},{"$f":"'1-03-15'!$P18","v":0},0,0,4]
[5,"APPLIANCESONLINE.COM.AU",{"$f":"'9-11-14'!$P19","v":0},{"$f":"'14-12-14'!$P19","v":0},{"$f":"'25-01-15'!$P19","v":0},{"$f":"'8-02-15'!$P19","v":0},{"$f":"'1-03-15'!$P19","v":0},0,0,5]
[6,"COOPERS 62-RAG & FAMISH HOTEL",{"$f":"'9-11-14'!$P20","v":0},{"$f":"'14-12-14'!$P20","v":0},{"$f":"'25-01-15'!$P20","v":0},{"$f":"'8-02-15'!$P20","v":0},{"$f":"'1-03-15'!$P20","v":0},0,0,6]
[7,"GOTTA LOVE IT 7",{"$f":"'9-11-14'!$P21","v":0},{"$f":"'14-12-14'!$P21","v":0},{"$f":"'25-01-15'!$P21","v":0},{"$f":"'8-02-15'!$P21","v":0},{"$f":"'1-03-15'!$P21","v":0},0,0,7]
[8,"SMEG",{"$f":"'9-11-14'!$P22","v":0},{"$f":"'14-12-14'!$P22","v":0},{"$f":"'25-01-15'!$P22","v":0},{"$f":"'8-02-15'!$P22","v":0},{"$f":"'1-03-15'!$P22","v":0},0,0,8]
[9,"PURE BLONDE",{"$f":"'9-11-14'!$P23","v":0},{"$f":"'14-12-14'!$P23","v":0},{"$f":"'25-01-15'!$P23","v":0},{"$f":"'8-02-15'!$P23","v":0},{"$f":"'1-03-15'!$P23","v":0},0,0,9]
[10,"FISHER & PAYKEL",{"$f":"'9-11-14'!$P24","v":0},{"$f":"'14-12-14'!$P24","v":0},{"$f":"'25-01-15'!$P24","v":0},{"$f":"'8-02-15'!$P24","v":0},{"$f":"'1-03-15'!$P24","v":0},0,0,10]
[11,"MOJO WINE",{"$f":"'9-11-14'!$P25","v":0},{"$f":"'14-12-14'!$P25","v":0},{"$f":"'25-01-15'!$P25","v":0},{"$f":"'8-02-15'!$P25","v":0},{"$f":"'1-03-15'!$P25","v":0},0,0,11]
[12,"LUMIX",{"$f":"'9-11-14'!$P26","v":0},{"$f":"'14-12-14'!$P26","v":0},{"$f":"'25-01-15'!$P26","v":0},{"$f":"'8-02-15'!$P26","v":0},{"$f":"'1-03-15'!$P26","v":0},0,0,12]
[13,"COMPASSMARKETS.COM",{"$f":"'9-11-14'!$P27","v":0},{"$f":"'14-12-14'!$P27","v":0},{"$f":"'25-01-15'!$P27","v":0},{"$f":"'8-02-15'!$P27","v":0},{"$f":"'1-03-15'!$P27","v":0},0,0,13]
[14,"THE KITCHEN MAKER",{"$f":"'9-11-14'!$P28","v":0},{"$f":"'14-12-14'!$P28","v":0},{"$f":"'25-01-15'!$P28","v":0},{"$f":"'8-02-15'!$P28","v":0},{"$f":"'1-03-15'!$P28","v":0},0,0,14]
[15,"NOAKES SAILING",{"$f":"'9-11-14'!$P29","v":0},{"$f":"'14-12-14'!$P29","v":0},{"$f":"'25-01-15'!$P29","v":0},{"$f":"'8-02-15'!$P29","v":0},{"$f":"'1-03-15'!$P29","v":0},0,0,15]
[16,"HAIER APPLIANCES",{"$f":"'9-11-14'!$P30","v":0},{"$f":"'14-12-14'!$P30","v":0},{"$f":"'25-01-15'!$P30","v":0},{"$f":"'8-02-15'!$P30","v":0},{"$f":"'1-03-15'!$P30","v":0},0,0,16]
[17,"ILVE",{"$f":"'9-11-14'!$P31","v":0},{"$f":"'14-12-14'!$P31","v":0},{"$f":"'25-01-15'!$P31","v":0},{"$f":"'8-02-15'!$P31","v":0},{"$f":"'1-03-15'!$P31","v":0},0,0,17]
[18,"VIAGOGO",300,{"$f":"'14-12-14'!$P32","v":0},{"$f":"'25-01-15'!$P32","v":0},{"$f":"'8-02-15'!$P32","v":0},{"$f":"'1-03-15'!$P32","v":0},300,300,18]
[19,"ILVE",300,{"$f":"'14-12-14'!$P33","v":0},{"$f":"'25-01-15'!$P33","v":0},{"$f":"'8-02-15'!$P33","v":0},{"$f":"'1-03-15'!$P33","v":0},300,300,19]
[null,null,null,null,null,null,null,null,null,20]
[null,null,null,null,null,null,null,null,null,21]
[null,null,null,null,null,null,null,null,null,22]
[null,null,null,null,null,null,null,null,null,23]
[]
["NOTE:"]
[]
[]
[]
["Australian 18ft Skiff 2013/14 Championship Pointscore"]
[null,"Best 4 results will count.",{"$f":"'11-01-15'!$G4","v":"2015-01-11"},{"$f":"'18-01-15'!$G4","v":"2015-01-18"},{"$f":"'25-01-15'!$G4","v":"2015-01-25"},{"$f":"'26-01-15'!$G4","v":"2015-01-26"},{"$f":"'1-02-15'!$G4","v":"2015-02-01"},null,1,"DROP"]
["Recall","Name","R1","R2","R3","R4","R5"," ","Total","Total","POS"]
[1,"THURLOW FISHER LAWYERS",{"$f":"'11-01-15'!$P15","v":0},{"$f":"'18-01-15'!$P15","v":0},{"$f":"'25-01-15'!$P15","v":0},{"$f":"'26-01-15'!$P15","v":0},{"$f":"'1-02-15'!$P15","v":0},null,{"$f":"SUM(C124:H124)","v":0},{"$f":"IF(I$122=1,SUM(C124:H124)-MAX(C124:H124),SUM(C124:H124))","v":0},1]
[2,"YANDOO",{"$f":"'11-01-15'!$P16","v":0},{"$f":"'18-01-15'!$P16","v":0},{"$f":"'25-01-15'!$P16","v":0},{"$f":"'26-01-15'!$P16","v":0},{"$f":"'1-02-15'!$P16","v":0},null,0,0,2]
[3,"ASKO APPLIANCES",{"$f":"'11-01-15'!$P17","v":0},{"$f":"'18-01-15'!$P17","v":0},{"$f":"'25-01-15'!$P17","v":0},{"$f":"'26-01-15'!$P17","v":0},{"$f":"'1-02-15'!$P17","v":0},null,0,0,3]
[4,"DE’LONGHI-RABBITOHS",{"$f":"'11-01-15'!$P18","v":0},{"$f":"'18-01-15'!$P18","v":0},{"$f":"'25-01-15'!$P18","v":0},{"$f":"'26-01-15'!$P18","v":0},{"$f":"'1-02-15'!$P18","v":0},null,0,0,4]
[5,"APPLIANCESONLINE.COM.AU",{"$f":"'11-01-15'!$P19","v":0},{"$f":"'18-01-15'!$P19","v":0},{"$f":"'25-01-15'!$P19","v":0},{"$f":"'26-01-15'!$P19","v":0},{"$f":"'1-02-15'!$P19","v":0},null,0,0,5]
[6,"COOPERS 62-RAG & FAMISH HOTEL",{"$f":"'11-01-15'!$P20","v":0},{"$f":"'18-01-15'!$P20","v":0},{"$f":"'25-01-15'!$P20","v":0},{"$f":"'26-01-15'!$P20","v":0},{"$f":"'1-02-15'!$P20","v":0},null,0,0,6]
[7,"GOTTA LOVE IT 7",{"$f":"'11-01-15'!$P21","v":0},{"$f":"'18-01-15'!$P21","v":0},{"$f":"'25-01-15'!$P21","v":0},{"$f":"'26-01-15'!$P21","v":0},{"$f":"'1-02-15'!$P21","v":0},null,0,0,7]
[8,"SMEG",{"$f":"'11-01-15'!$P22","v":0},{"$f":"'18-01-15'!$P22","v":0},{"$f":"'25-01-15'!$P22","v":0},{"$f":"'26-01-15'!$P22","v":0},{"$f":"'1-02-15'!$P22","v":0},null,0,0,8]
[9,"PURE BLONDE",{"$f":"'11-01-15'!$P23","v":0},{"$f":"'18-01-15'!$P23","v":0},{"$f":"'25-01-15'!$P23","v":0},{"$f":"'26-01-15'!$P23","v":0},{"$f":"'1-02-15'!$P23","v":0},null,0,0,9]
[10,"FISHER & PAYKEL",{"$f":"'11-01-15'!$P24","v":0},{"$f":"'18-01-15'!$P24","v":0},{"$f":"'25-01-15'!$P24","v":0},{"$f":"'26-01-15'!$P24","v":0},{"$f":"'1-02-15'!$P24","v":0},null,0,0,10]
[11,"MOJO WINE",{"$f":"'11-01-15'!$P25","v":0},{"$f":"'18-01-15'!$P25","v":0},{"$f":"'25-01-15'!$P25","v":0},{"$f":"'26-01-15'!$P25","v":0},{"$f":"'1-02-15'!$P25","v":0},null,0,0,11]
[12,"LUMIX",{"$f":"'11-01-15'!$P26","v":0},{"$f":"'18-01-15'!$P26","v":0},{"$f":"'25-01-15'!$P26","v":0},{"$f":"'26-01-15'!$P26","v":0},{"$f":"'1-02-15'!$P26","v":0},null,0,0,12]
[13,"RABBITOHS-KENWOOD",{"$f":"'11-01-15'!$P27","v":0},{"$f":"'18-01-15'!$P27","v":0},{"$f":"'25-01-15'!$P27","v":0},{"$f":"'26-01-15'!$P27","v":0},{"$f":"'1-02-15'!$P27","v":0},null,0,0,13]
[14,"THE KITCHEN MAKER",{"$f":"'11-01-15'!$P28","v":0},{"$f":"'18-01-15'!$P28","v":0},{"$f":"'25-01-15'!$P28","v":0},{"$f":"'26-01-15'!$P28","v":0},{"$f":"'1-02-15'!$P28","v":0},null,0,0,14]
[15,"HAIER APPLIANCES",{"$f":"'11-01-15'!$P29","v":0},{"$f":"'18-01-15'!$P29","v":0},{"$f":"'25-01-15'!$P29","v":0},{"$f":"'26-01-15'!$P29","v":0},{"$f":"'1-02-15'!$P29","v":0},null,0,0,15]
[16,"SYDNEY CITY MARINE",{"$f":"'11-01-15'!$P30","v":0},{"$f":"'18-01-15'!$P30","v":0},{"$f":"'25-01-15'!$P30","v":0},{"$f":"'26-01-15'!$P30","v":0},{"$f":"'1-02-15'!$P30","v":0},null,0,0,16]
[17,"COMPASSFOREX.COM.AU",{"$f":"'11-01-15'!$P31","v":0},{"$f":"'18-01-15'!$P31","v":0},{"$f":"'25-01-15'!$P31","v":0},{"$f":"'26-01-15'!$P31","v":0},{"$f":"'1-02-15'!$P31","v":0},null,0,0,17]
[18,"VIAGOGO",{"$f":"'11-01-15'!$P32","v":0},{"$f":"'18-01-15'!$P32","v":0},{"$f":"'25-01-15'!$P32","v":0},{"$f":"'26-01-15'!$P32","v":0},{"$f":"'1-02-15'!$P32","v":0},null,0,0,18]
[19,"ILVE",{"$f":"'11-01-15'!$P33","v":0},{"$f":"'18-01-15'!$P33","v":0},{"$f":"'25-01-15'!$P33","v":0},{"$f":"'26-01-15'!$P33","v":0},{"$f":"'1-02-15'!$P33","v":0},null,0,0,19]
[20,null,{"$f":"'11-01-15'!$P34","v":0},{"$f":"'18-01-15'!$P34","v":0},{"$f":"'25-01-15'!$P34","v":0},{"$f":"'26-01-15'!$P34","v":0},{"$f":"'1-02-15'!$P34","v":0},null,0,0,20]
[21,null,{"$f":"'11-01-15'!$P35","v":0},{"$f":"'18-01-15'!$P35","v":0},{"$f":"'25-01-15'!$P35","v":0},{"$f":"'26-01-15'!$P35","v":0},{"$f":"'1-02-15'!$P35","v":0},null,0,0,21]
[22,null,{"$f":"'11-01-15'!$P36","v":0},{"$f":"'18-01-15'!$P36","v":0},{"$f":"'25-01-15'!$P36","v":0},{"$f":"'26-01-15'!$P36","v":0},{"$f":"'1-02-15'!$P36","v":0},null,0,0,22]
[23,null,{"$f":"'11-01-15'!$P37","v":0},{"$f":"'18-01-15'!$P37","v":0},{"$f":"'25-01-15'!$P37","v":0},{"$f":"'26-01-15'!$P37","v":0},{"$f":"'1-02-15'!$P37","v":0},null,0,0,23]
[24,null,{"$f":"'11-01-15'!$P38","v":0},{"$f":"'18-01-15'!$P38","v":0},{"$f":"'25-01-15'!$P38","v":0},{"$f":"'26-01-15'!$P38","v":0},{"$f":"'1-02-15'!$P38","v":0},null,0,0,24]
[]
[]
["AUSTRALIAN 18Ft League - 2010/11 J. J. Giltinan Selection Point Score"]
[null,"Best 9 results will count.",{"$f":"'9-11-14'!G4","v":"2014-11-09"},{"$f":"'16-11-14'!G4","v":"2014-11-16"},{"$f":"'14-12-14'!G4","v":"2014-12-14"},{"$f":"'30-11-14'!G4","v":"2014-11-30"},{"$f":"'7-12-14'!G4","v":"2014-12-07"},{"$f":"'11-01-15'!G4","v":"2015-01-11"},{"$f":"'18-01-15'!G4","v":"2015-01-18"},{"$f":"'25-01-15'!G4","v":"2015-01-25"},{"$f":"'26-01-15'!G4","v":"2015-01-26"},{"$f":"'1-02-15'!G4","v":"2015-02-01"},null,null,0,"DROPS"]
["Recall","Name","R1","R2","R3","R4","R5","R6","R7","R8","R9","R10",null," ","Total","Total","POS",null,null,null,null,null,null,null,null,null,null,null,null,null,"Drop1","Drop2"]
[1,"THURLOW FISHER LAWYERS",{"$f":"'2-11-14'!$P15","v":0},{"$f":"'9-11-14'!$P15","v":0},{"$f":"'16-11-14'!$P15","v":0},{"$f":"'14-12-14'!$P15","v":0},{"$f":"'30-11-14'!$P15","v":0},{"$f":"'7-12-14'!$P15","v":0},{"$f":"'11-01-15'!$P15","v":0},{"$f":"'18-01-15'!$P15","v":0},{"$f":"'25-01-15'!$P15","v":0},{"$f":"'26-01-15'!$P15","v":0},null,null,{"$f":"SUM(C153:N153)","v":0},{"$f":"IF(O$151=0,O153,O153-AE152-AF152)","v":0},1,null,null,null,null,null,null,null,null,null,null,null,null,null,{"$f":"MAX(C154:N154)","v":0},{"$f":"LARGE(C154:N154,2)","v":0}]
[2,"YANDOO",{"$f":"'2-11-14'!$P16","v":0},{"$f":"'9-11-14'!$P16","v":0},{"$f":"'16-11-14'!$P16","v":0},{"$f":"'14-12-14'!$P16","v":0},{"$f":"'30-11-14'!$P16","v":0},{"$f":"'7-12-14'!$P16","v":0},{"$f":"'11-01-15'!$P16","v":0},{"$f":"'18-01-15'!$P16","v":0},{"$f":"'25-01-15'!$P16","v":0},{"$f":"'26-01-15'!$P16","v":0},null,null,0,0,2,null,null,null,null,null,null,null,null,null,null,null,null,null,0,0]
[3,"ASKO APPLIANCES",{"$f":"'2-11-14'!$P17","v":0},{"$f":"'9-11-14'!$P17","v":0},{"$f":"'16-11-14'!$P17","v":0},{"$f":"'14-12-14'!$P17","v":0},{"$f":"'30-11-14'!$P17","v":0},{"$f":"'7-12-14'!$P17","v":0},{"$f":"'11-01-15'!$P17","v":0},{"$f":"'18-01-15'!$P17","v":0},{"$f":"'25-01-15'!$P17","v":0},{"$f":"'26-01-15'!$P17","v":0},null,null,0,0,3,null,null,null,null,null,null,null,null,null,null,null,null,null,0,0]
[4,"DE'LONGHI",{"$f":"'2-11-14'!$P18","v":0},{"$f":"'9-11-14'!$P18","v":0},{"$f":"'16-11-14'!$P18","v":0},{"$f":"'14-12-14'!$P18","v":0},{"$f":"'30-11-14'!$P18","v":0},{"$f":"'7-12-14'!$P18","v":0},{"$f":"'11-01-15'!$P18","v":0},{"$f":"'18-01-15'!$P18","v":0},{"$f":"'25-01-15'!$P18","v":0},{"$f":"'26-01-15'!$P18","v":0},null,null,0,0,4,null,null,null,null,null,null,null,null,null,null,null,null,null,0,0]
[5,"APPLIANCESONLINE.COM.AU",{"$f":"'2-11-14'!$P19","v":0},{"$f":"'9-11-14'!$P19","v":0},{"$f":"'16-11-14'!$P19","v":0},{"$f":"'14-12-14'!$P19","v":0},{"$f":"'30-11-14'!$P19","v":0},{"$f":"'7-12-14'!$P19","v":0},{"$f":"'11-01-15'!$P19","v":0},{"$f":"'18-01-15'!$P19","v":0},{"$f":"'25-01-15'!$P19","v":0},{"$f":"'26-01-15'!$P19","v":0},null,null,0,0,5,null,null,null,null,null,null,null,null,null,null,null,null,null,0,0]
[6,"RAG & FAMISH HOTEL-COOPERS",{"$f":"'2-11-14'!$P20","v":0},{"$f":"'9-11-14'!$P20","v":0},{"$f":"'16-11-14'!$P20","v":0},{"$f":"'14-12-14'!$P20","v":0},{"$f":"'30-11-14'!$P20","v":0},{"$f":"'7-12-14'!$P20","v":0},{"$f":"'11-01-15'!$P20","v":0},{"$f":"'18-01-15'!$P20","v":0},{"$f":"'25-01-15'!$P20","v":0},{"$f":"'26-01-15'!$P20","v":0},null,null,0,0,6,null,null,null,null,null,null,null,null,null,null,null,null,null,0,0]
[7,"GOTTA LOVE IT 7",{"$f":"'2-11-14'!$P21","v":0},{"$f":"'9-11-14'!$P21","v":0},{"$f":"'16-11-14'!$P21","v":0},{"$f":"'14-12-14'!$P21","v":0},{"$f":"'30-11-14'!$P21","v":0},{"$f":"'7-12-14'!$P21","v":0},{"$f":"'11-01-15'!$P21","v":0},{"$f":"'18-01-15'!$P21","v":0},{"$f":"'25-01-15'!$P21","v":0},{"$f":"'26-01-15'!$P21","v":0},null,null,0,0,7,null,null,null,null,null,null,null,null,null,null,null,null,null,0,0]
[8,"SMEG",{"$f":"'2-11-14'!$P22","v":0},{"$f":"'9-11-14'!$P22","v":0},{"$f":"'16-11-14'!$P22","v":0},{"$f":"'14-12-14'!$P22","v":0},{"$f":"'30-11-14'!$P22","v":0},{"$f":"'7-12-14'!$P22","v":0},{"$f":"'11-01-15'!$P22","v":0},{"$f":"'18-01-15'!$P22","v":0},{"$f":"'25-01-15'!$P22","v":0},{"$f":"'26-01-15'!$P22","v":0},null,null,0,0,8,null,null,null,null,null,null,null,null,null,null,null,null,null,0,0]
[9,"PURE BLONDE",{"$f":"'2-11-14'!$P23","v":0},{"$f":"'9-11-14'!$P23","v":0},{"$f":"'16-11-14'!$P23","v":0},{"$f":"'14-12-14'!$P23","v":0},{"$f":"'30-11-14'!$P23","v":0},{"$f":"'7-12-14'!$P23","v":0},{"$f":"'11-01-15'!$P23","v":0},{"$f":"'18-01-15'!$P23","v":0},{"$f":"'25-01-15'!$P23","v":0},{"$f":"'26-01-15'!$P23","v":0},null,null,0,0,9,null,null,null,null,null,null,null,null,null,null,null,null,null,0,0]
[10,"FISHER & PAYKEL",{"$f":"'2-11-14'!$P24","v":0},{"$f":"'9-11-14'!$P24","v":0},{"$f":"'16-11-14'!$P24","v":0},{"$f":"'14-12-14'!$P24","v":0},{"$f":"'30-11-14'!$P24","v":0},{"$f":"'7-12-14'!$P24","v":0},{"$f":"'11-01-15'!$P24","v":0},{"$f":"'18-01-15'!$P24","v":0},{"$f":"'25-01-15'!$P24","v":0},{"$f":"'26-01-15'!$P24","v":0},null,null,0,0,10,null,null,null,null,null,null,null,null,null,null,null,null,null,0,0]
[11,"RED CLAW",{"$f":"'2-11-14'!$P25","v":0},{"$f":"'9-11-14'!$P25","v":0},{"$f":"'16-11-14'!$P25","v":0},{"$f":"'14-12-14'!$P25","v":0},{"$f":"'30-11-14'!$P25","v":0},{"$f":"'7-12-14'!$P25","v":0},{"$f":"'11-01-15'!$P25","v":0},{"$f":"'18-01-15'!$P25","v":0},{"$f":"'25-01-15'!$P25","v":0},{"$f":"'26-01-15'!$P25","v":0},null,null,0,0,11,null,null,null,null,null,null,null,null,null,null,null,null,null,0,0]
[12,"PANASONIC",{"$f":"'2-11-14'!$P26","v":0},{"$f":"'9-11-14'!$P26","v":0},{"$f":"'16-11-14'!$P26","v":0},{"$f":"'14-12-14'!$P26","v":0},{"$f":"'30-11-14'!$P26","v":0},{"$f":"'7-12-14'!$P26","v":0},{"$f":"'11-01-15'!$P26","v":0},{"$f":"'18-01-15'!$P26","v":0},{"$f":"'25-01-15'!$P26","v":0},{"$f":"'26-01-15'!$P26","v":0},null,null,0,0,12,null,null,null,null,null,null,null,null,null,null,null,null,null,0,0]
[13,"SHARKS",{"$f":"'2-11-14'!$P27","v":0},{"$f":"'9-11-14'!$P27","v":0},{"$f":"'16-11-14'!$P27","v":0},{"$f":"'14-12-14'!$P27","v":0},{"$f":"'30-11-14'!$P27","v":0},{"$f":"'7-12-14'!$P27","v":0},{"$f":"'11-01-15'!$P27","v":0},{"$f":"'18-01-15'!$P27","v":0},{"$f":"'25-01-15'!$P27","v":0},{"$f":"'26-01-15'!$P27","v":0},null,null,0,0,13,null,null,null,null,null,null,null,null,null,null,null,null,null,0,0]
[14,"TF COLLECT",{"$f":"'2-11-14'!$P28","v":0},{"$f":"'9-11-14'!$P28","v":0},{"$f":"'16-11-14'!$P28","v":0},{"$f":"'14-12-14'!$P28","v":0},{"$f":"'30-11-14'!$P28","v":0},{"$f":"'7-12-14'!$P28","v":0},{"$f":"'11-01-15'!$P28","v":0},{"$f":"'18-01-15'!$P28","v":0},{"$f":"'25-01-15'!$P28","v":0},{"$f":"'26-01-15'!$P28","v":0},null,null,0,0,14,null,null,null,null,null,null,null,null,null,null,null,null,null,0,0]
[15,"THE KITCHEN MAKER",{"$f":"'2-11-14'!$P29","v":0},{"$f":"'9-11-14'!$P29","v":0},{"$f":"'16-11-14'!$P29","v":0},{"$f":"'14-12-14'!$P29","v":0},{"$f":"'30-11-14'!$P29","v":0},{"$f":"'7-12-14'!$P29","v":0},{"$f":"'11-01-15'!$P29","v":0},{"$f":"'18-01-15'!$P29","v":0},{"$f":"'25-01-15'!$P29","v":0},{"$f":"'26-01-15'!$P29","v":0},null,null,0,0,15,null,null,null,null,null,null,null,null,null,null,null,null,null,0,0]
[16,"PROJECT RACING",{"$f":"'2-11-14'!$P30","v":0},{"$f":"'9-11-14'!$P30","v":0},{"$f":"'16-11-14'!$P30","v":0},{"$f":"'14-12-14'!$P30","v":0},{"$f":"'30-11-14'!$P30","v":0},{"$f":"'7-12-14'!$P30","v":0},{"$f":"'11-01-15'!$P30","v":0},{"$f":"'18-01-15'!$P30","v":0},{"$f":"'25-01-15'!$P30","v":0},{"$f":"'26-01-15'!$P30","v":0},null,null,0,0,16,null,null,null,null,null,null,null,null,null,null,null,null,null,0,0]
[17,"COLDWELL BANKER NEW HOMES",{"$f":"'2-11-14'!$P31","v":0},{"$f":"'9-11-14'!$P31","v":0},{"$f":"'16-11-14'!$P31","v":0},{"$f":"'14-12-14'!$P31","v":0},{"$f":"'30-11-14'!$P31","v":0},{"$f":"'7-12-14'!$P31","v":0},{"$f":"'11-01-15'!$P31","v":0},{"$f":"'18-01-15'!$P31","v":0},{"$f":"'25-01-15'!$P31","v":0},{"$f":"'26-01-15'!$P31","v":0},null,null,0,0,17,null,null,null,null,null,null,null,null,null,null,null,null,null,0,0]
[18,"BOATMATE",{"$f":"'2-11-14'!$P32","v":0},{"$f":"'9-11-14'!$P32","v":0},{"$f":"'16-11-14'!$P32","v":0},{"$f":"'14-12-14'!$P32","v":0},{"$f":"'30-11-14'!$P32","v":0},{"$f":"'7-12-14'!$P32","v":0},{"$f":"'11-01-15'!$P32","v":0},{"$f":"'18-01-15'!$P32","v":0},{"$f":"'25-01-15'!$P32","v":0},{"$f":"'26-01-15'!$P32","v":0},null,null,0,0,18,null,null,null,null,null,null,null,null,null,null,null,null,null,0,0]
[19,null,{"$f":"'2-11-14'!$P33","v":0},{"$f":"'9-11-14'!$P33","v":0},{"$f":"'16-11-14'!$P33","v":0},{"$f":"'14-12-14'!$P33","v":0},{"$f":"'30-11-14'!$P33","v":0},{"$f":"'7-12-14'!$P33","v":0},{"$f":"'11-01-15'!$P33","v":0},{"$f":"'18-01-15'!$P33","v":0},{"$f":"'25-01-15'!$P33","v":0},{"$f":"'26-01-15'!$P33","v":0},null,null,0,0,19,null,null,null,null,null,null,null,null,null,null,null,null,null,0,0]
[20,null,{"$f":"'2-11-14'!$P34","v":0},{"$f":"'9-11-14'!$P34","v":0},{"$f":"'16-11-14'!$P34","v":0},{"$f":"'14-12-14'!$P34","v":0},{"$f":"'30-11-14'!$P34","v":0},{"$f":"'7-12-14'!$P34","v":0},{"$f":"'11-01-15'!$P34","v":0},{"$f":"'18-01-15'!$P34","v":0},{"$f":"'25-01-15'!$P34","v":0},{"$f":"'26-01-15'!$P34","v":0},null,null,0,0,20,null,null,null,null,null,null,null,null,null,null,null,null,null,0,0]
[21,null,{"$f":"'2-11-14'!$P35","v":0},{"$f":"'9-11-14'!$P35","v":0},{"$f":"'16-11-14'!$P35","v":0},{"$f":"'14-12-14'!$P35","v":0},{"$f":"'30-11-14'!$P35","v":0},{"$f":"'7-12-14'!$P35","v":0},{"$f":"'11-01-15'!$P35","v":0},{"$f":"'18-01-15'!$P35","v":0},{"$f":"'25-01-15'!$P35","v":0},{"$f":"'26-01-15'!$P35","v":0},null,null,0,0,21,null,null,null,null,null,null,null,null,null,null,null,null,null,0,0]
[22,null,{"$f":"'2-11-14'!$P36","v":0},{"$f":"'9-11-14'!$P36","v":0},{"$f":"'16-11-14'!$P36","v":0},{"$f":"'14-12-14'!$P36","v":0},{"$f":"'30-11-14'!$P36","v":0},{"$f":"'7-12-14'!$P36","v":0},{"$f":"'11-01-15'!$P36","v":0},{"$f":"'18-01-15'!$P36","v":0},{"$f":"'25-01-15'!$P36","v":0},{"$f":"'26-01-15'!$P36","v":0},null,null,0,0,22,null,null,null,null,null,null,null,null,null,null,null,null,null,0,0]
[23,null,{"$f":"'2-11-14'!$P37","v":0},{"$f":"'9-11-14'!$P37","v":0},{"$f":"'16-11-14'!$P37","v":0},{"$f":"'14-12-14'!$P37","v":0},{"$f":"'30-11-14'!$P37","v":0},{"$f":"'7-12-14'!$P37","v":0},{"$f":"'11-01-15'!$P37","v":0},{"$f":"'18-01-15'!$P37","v":0},{"$f":"'25-01-15'!$P37","v":0},{"$f":"'26-01-15'!$P37","v":0},null,null,0,0,23]
[]
["NOTE:"]

{"sheet":"26-10-14","index":1,"n_rows":57,"n_cols":17,"rows_kept":57,"cut":false,"hidden":false,"merged":[[48,0,48,2],[48,3,48,7],[9,0,9,1],[46,0,46,2],[46,3,46,7],[47,0,47,2],[47,3,47,7],[12,15,12,16],[12,0,12,1],[0,0,0,7],[1,0,1,7],[3,0,3,1],[3,6,3,7],[7,0,7,1],[7,3,7,4],[7,5,7,7],[6,0,6,1],[51,3,51,7],[54,0,54,1],[49,0,49,2],[52,3,55,7],[53,0,53,1],[49,3,49,7],[50,0,50,2],[50,3,50,7],[51,0,51,2]]}
["Australian 18 Footers League"]
["Starters and Judges Report"]
[]
["Name of Race:",null,{"$f":"Schedule!$D4","v":"Club Championship – Race 1"},"Entrants:",{"$f":"Schedule!G4","v":17},"Date:",{"$f":"Schedule!B4","v":"2014-10-26"}]
[null,null,{"$f":"Schedule!$E4","v":"Alf Beashel Memorial Trophy"}]
[null,null,{"$f":"Schedule!$F4","v":""},null,null,null,null,null,null,null,null,null,"Ctrl+Shift+R to formulate H/cap result."]
["Course:",null,"03:00:00","Wind:","se","Tide:","EBBING",null,null,null,null,null,"Ctrl+Shift+T to enter Finish Times"]
["Race Start Time:",null,"02:56:00","Race Finish Time :",null,"04:01:35"]
[]
["Start/Race Mode:",null,{"$f":"IF(Schedule!C4=\"3b\",\"SCRATCH/3 BUOY\",\"SCRATCH\")","v":"SCRATCH"}]
[null,"Non Starters:",0,"Non Finishers:",0]
[]
["Race Officer:",null,"JEREMY WHITTY",null,null,null,null,null,null,null,null,null,"Entrants",null,null,"Result"]
["Finish Placings","Recall #","Boat Name","Finish Time","Elapsed Time","Handicap","Corrected Time",{"$f":"IF(C10=\"Scratch\",\"H/cap Position\",\"Scratch Position\")","v":"H/cap Position"},null,null,null,"Recall #","Boat Name","H/CAP",null,"Scratch","H/Cap"]
[1,7,{"$f":"IF(ISBLANK(B15),\"\",VLOOKUP(B15,L$15:M$45,2))","v":"GOTTA LOVE IT 7"},"04:01:35",{"$f":"IF(ISBLANK(D15),\"\",D15-C$8)","v":"01:05:35"},{"$f":"IF(ISBLANK(B15),\"\",VLOOKUP(B15,L$15:N$45,3))","v":0},{"$f":"IF(ISBLANK(D15),\"\",IF(C$10=\"Scratch\",E15-TIME(,F15,),E15))","v":"01:05:35"},null,1,null,null,1,"THURLOW FISHER LAWYERS",0]
[2,6,"COOPERS 62-RAG & FAMISH HOTEL","04:04:33","01:08:33",4,"01:04:33",null,2,null,null,2,"YANDOO",8]
[3,8,"SMEG","04:06:03","01:10:03",7,"01:03:03",null,3,null,null,3,"ASKO APPLIANCES",4]
[4,2,"YANDOO","04:06:24","01:10:24",8,"01:02:24",null,4,null,null,4,"DE’LONGHI",10]
[5,13,"COMPASSMARKETS.COM","04:08:04","01:12:04",9,"01:03:04",null,5,null,null,5,"APPLIANCESONLINE.COM.AU",6]
[6,11,"MOJO WINE","04:08:05","01:12:05",6,"01:06:05",null,6,null,null,6,"COOPERS 62-RAG & FAMISH HOTEL",4]
[7,3,"ASKO APPLIANCES","04:10:59","01:14:59",4,"01:10:59",null,7,null,null,7,"GOTTA LOVE IT 7",0]
[8,4,"DE’LONGHI","04:12:04","01:16:04",10,"01:06:04",null,8,null,null,8,"SMEG",7]
[9,1,"THURLOW FISHER LAWYERS","04:12:10","01:16:10",0,"01:16:10",null,9,null,null,9,"PURE BLONDE",10]
[10,10,"FISHER & PAYKEL","04:12:56","01:16:56",10,"01:06:56",null,10,null,null,10,"FISHER & PAYKEL",10]
[11,12,"LUMIX","04:13:40","01:17:40",9,"01:08:40",null,11,null,null,11,"MOJO WINE",6]
[12,15,"NOAKES SAILING","04:19:58","01:23:58",9,"01:14:58",null,12,null,null,12,"LUMIX",9]
[13,17,"ILVE","04:40:18","01:44:18",10,"01:34:18",null,13,null,null,13,"COMPASSMARKETS.COM",9]
[14,16,"HAIER APPLIANCES","04:40:50","01:44:50",10,"01:34:50",null,14,null,null,14,"THE KITCHEN MAKER",9]
[15,null,"",null,"","","",null,15,null,null,15,"NOAKES SAILING",9]
[16,null,"",null,"","","",null,16,null,null,16,"HAIER APPLIANCES",10]
[17,null,"",null,"","","",null,17,null,null,17,"ILVE",10]
[18,null,"",null,"","","",null,18,null,null,18]
[19,null,"",null,"","","",null,19,null,null,19]
[20,null,"",null,"","","",null,20,null,null,20]
[21,null,"",null,"","","",null,21,null,null,21]
[22,null,"",null,"","","",null,22,null,null,22]
[23,null,"",null,"","","",null,23,null,null,23]
[24,null,"",null,"","","",null,24]
[25,null,"",null,"","","",null,25]
[26,null,"",null,"","","",null,26]
[27,null,"",null,"","","",null,27]
[28,null,"",null,"","","",null,28]
[29,null,"",null,"","","",null,29]
[30,null,"",null,"","","",null,30]
[31,null,null,null,null,null,null,null,31]
[]
["Non Starters","Non Starters",null,"Non Finishers","Non Finishers"]
["9 PURE BLONDE",null,null,"14 KITCHEN MAKER"]
["5 APPLIANCES ONLINE"]
[]
[]
[]
[null,null,"Comments:"]
["Sailing Time:",null,{"$f":"E15","v":"01:05:35"}]
["Fastest Time:",null,{"$f":"C15","v":"GOTTA LOVE IT 7"}]
["Margins:","1st - 2nd",{"$f":"D16-D15","v":"00:02:58"}]
[null,"2nd - 3rd",{"$f":"D17-D16","v":"00:01:30"}]

{"sheet":"2-11-14","index":2,"n_rows":57,"n_cols":18,"rows_kept":57,"cut":false,"hidden":false,"merged":[[9,0,9,1],[48,0,48,2],[48,3,48,7],[12,15,12,16],[12,0,12,1],[12,4,12,6],[47,0,47,2],[47,3,47,7],[46,3,46,7],[46,0,46,2],[0,0,0,7],[1,0,1,7],[3,0,3,1],[3,6,3,7],[7,0,7,1],[7,3,7,4],[7,5,7,7],[6,0,6,1],[52,3,55,7],[53,0,53,1],[54,0,54,1],[49,0,49,2],[49,3,49,7],[51,3,51,7],[50,0,50,2],[50,3,50,7],[51,0,51,2]]}
["Australian 18 Footers League"]
["Starters and Judges Report"]
[]
["Name of Race:",null,{"$f":"Schedule!$D5","v":"Mick Scully Memorial Trophy"},"Entrants:",{"$f":"Schedule!G5","v":17},"Date:",{"$f":"Schedule!B5","v":"2014-11-02"}]
[null,null,{"$f":"Schedule!$E5","v":"   "}]
[null,null,{"$f":"Schedule!$F5","v":""},null,null,null,null,null,null,null,null,null,"Ctrl+Shift+R to formulate H/cap result."]
["Course:",null,null,"Wind:",null,"Tide:"]
["Race Start Time:",null,null,"Race Finish Time :",null,{"$f":"D15","v":"00:00:00"}]
[]
["Start Mode:",null,{"$f":"IF(Schedule!C5=\"3b\",\"SCRATCH/3Buoy\",\"SCRATCH\")","v":"SCRATCH/3Buoy"}]
[null,"Non Starters:",0,"Non Finishers:",0,null,null,0]
[]
["Race Officer:",null,null,null,null,null,null,null,null,null,null,null,"Entrants",null,null,"Result"]
["Finish Placings","Recall #","Boat Name","Finish Time","Elapsed Time","Handicap","Corrected Time",{"$f":"IF(C10=\"Scratch\",\"H/cap Position\",\"Scratch Position\")","v":"Scratch Position"},null,null,null,"Recall #","Boat Name","H/CAP",null,"Scratch","H/Cap"]
[1,null,{"$f":"IF(ISBLANK(B15),\"\",VLOOKUP(B15,L$15:M$45,2))","v":""},null,{"$f":"IF(ISBLANK(D15),\"\",D15-C$8)","v":""},{"$f":"IF(ISBLANK(B15),\"\",VLOOKUP(B15,L$15:N$45,3))","v":""},{"$f":"IF(ISBLANK(D15),\"\",IF(C$10=\"Scratch\",E15-TIME(,F15,),E15))","v":""},null,1,null,null,1,"THURLOW FISHER LAWYERS",2,null,null,null,3]
[2,null,"",null,"","","",null,2,null,null,2,"YANDOO",4,null,null,null,12]
[3,null,"",null,"","","",null,3,null,null,3,"ASKO APPLIANCES",4,null,null,null,9]
[4,null,"",null,"","","",null,4,null,null,4,"DE’LONGHI-RABBITOHS",7,null,null,null,6]
[5,null,"",null,"","","",null,5,null,null,5,"APPLIANCESONLINE.COM.AU",3,null,null,null,2]
[6,null,"",null,"","","",null,6,null,null,6,"COOPERS 62-RAG & FAMISH HOTEL",1,null,null,null,14]
[7,null,"",null,"","","",null,7,null,null,7,"GOTTA LOVE IT 7",0,null,null,null,1]
[8,null,"",null,"","","",null,8,null,null,8,"SMEG",0,null,null,null,7]
[9,null,"",null,"","","",null,9,null,null,9,"PURE BLONDE",8,null,null,null,11]
[10,null,"",null,"","","",null,10,null,null,10,"FISHER & PAYKEL",1,null,null,null,4]
[11,null,"",null,"","","",null,11,null,null,11,"MOJO WINE",1,null,null,null,5]
[12,null,"",null,"","","",null,12,null,null,12,"LUMIX",3,null,null,null,13]
[13,null,"",null,"","","",null,13,null,null,13,"RABBITOHS-KENWOOD",10,null,null,null,10]
[14,null,"",null,"","","",null,14,null,null,14,"THE KITCHEN MAKER",8,null,null,null,8]
[15,null,"",null,"","","",null,15,null,null,15,"HAIER APPLIANCES",2,null,null,null,20]
[16,null,"",null,"","","",null,16,null,null,16,"SYDNEY CITY MARINE",1,null,null,null,20]
[17,null,"",null,"","","",null,17,null,null,17,"TEAM PEDRO",10,null,null,null,20]
[18,null,"",null,"","","",null,18,null,null,18,"VIAGOGO",10,null,null,null,20]
[19,null,"",null,"","","",null,19,null,null,19,"SOUTHERN CROSS",10,null,null,null,15]
[20,null,"",null,"","","",null,20,null,null,20,null,null,null,null,null,20]
[21,null,"",null,"","","",null,21,null,null,21,null,null,null,null,null,20]
[22,null,"",null,"","","",null,22,null,null,22,null,null,null,null,null,20]
[23,null,"",null,"","","",null,23,null,null,23,null,null,null,null,null,20]
[24,null,"",null,"","","",null,24,null,null,null,null,null,null,null,null,20]
[25,null,"",null,"","","",null,25]
[26,null,"",null,"","","",null,26]
[27,null,"",null,"","","",null,27]
[28,null,"",null,"","","",null,28]
[29,null,"",null,"","","",null,29]
[30,null,"",null,"","","",null,30]
[null,null,null,null,"",null,null,null,31]
[]
["Non Starters","Non Starters",null,"Non Finishers","Non Finishers"]
[]
[]
[]
[]
[]
[null,null,"Comments:"]
["Sailing Time:",null,{"$f":"E15","v":""}]
["Fastest Time:",null,{"$f":"C15","v":""}]
["Margins:","1st - 2nd",{"$f":"D16-D15","v":"00:00:00"}]
[null,"2nd - 3rd",{"$f":"D17-D16","v":"00:00:00"}]

{"sheet":"9-11-14","index":3,"n_rows":57,"n_cols":18,"rows_kept":57,"cut":false,"hidden":false,"merged":[[52,3,59,7],[48,0,48,2],[48,3,48,7],[6,0,6,1],[0,0,0,7],[1,0,1,7],[3,0,3,1],[3,6,3,7],[7,0,7,1],[7,3,7,4],[7,5,7,7],[46,0,46,2],[9,0,9,1],[53,0,53,1],[54,0,54,1],[49,0,49,2],[12,15,12,16],[47,0,47,2],[47,3,47,7],[46,3,46,7],[12,0,12,1],[12,4,12,6],[49,3,49,7],[51,3,51,7],[50,0,50,2],[50,3,50,7],[51,0,51,2]]}
["Australian 18 Footers League"]
["Starters and Judges Report"]
[]
["Name of Race:",null,{"$f":"Schedule!$D6","v":"Club Championship – Race 2"},"Entrants:",{"$f":"Schedule!G6","v":17},"Date:",{"$f":"Schedule!B6","v":"2014-11-09"}]
[null,null,{"$f":"Schedule!$E6","v":"Eric Bowen Memorial Trophy"}]
[null,null,{"$f":"Schedule!$F6","v":""},null,null,null,null,null,null,null,null,null,"Ctrl+Shift+R to formulate H/cap result."]
["Course:",null,null,"Wind:",null,"Tide:"]
["Race Start Time:",null,null,"Race Finish Time :",null,{"$f":"D15","v":"00:00:00"}]
[]
["Start Mode:",null,{"$f":"IF(Schedule!C6=\"3b\",\"SCRATCH/3Buoy\",\"SCRATCH\")","v":"SCRATCH"}]
[null,"Non Starters:",0,"Non Finishers:",0]
[]
["Race Officer:",null,null,null,null,null,null,null,null,null,null,null,"Entrants",null,null,"Result"]
["Finish Placings","Recall #","Boat Name","Finish Time","Elapsed Time","Handicap","Corrected Time",{"$f":"IF(C10=\"Scratch\",\"H/cap Position\",\"Scratch Position\")","v":"H/cap Position"},null,null,null,"Recall #","Boat Name","H/CAP",null,"Scratch","H/Cap"]
[1,null,{"$f":"IF(ISBLANK(B15),\"\",VLOOKUP(B15,L$15:M$45,2))","v":""},null,{"$f":"IF(ISBLANK(D15),\"\",D15-C$8)","v":""},{"$f":"IF(ISBLANK(B15),\"\",VLOOKUP(B15,L$15:N$45,3))","v":""},{"$f":"IF(ISBLANK(D15),\"\",IF(C$10=\"Scratch\",E15-TIME(,F15,),E15))","v":""},null,1,null,null,1,null,null,null,null,null,2]
[2,null,"",null,"","","",null,2,null,null,2,null,null,null,null,null,12]
[3,null,"",null,"","","",null,3,null,null,3,null,null,null,null,null,11]
[4,null,"",null,"","","",null,4,null,null,4,null,null,null,null,null,13]
[5,null,"",null,"","","",null,5,null,null,5,null,null,null,null,null,5]
[6,null,"",null,"","","",null,6,null,null,6,null,null,null,null,null,9]
[7,null,"",null,"","","",null,7,null,null,7,null,null,null,null,null,1]
[8,null,"",null,"","","",null,8,null,null,8,null,null,null,null,null,3]
[9,null,"",null,"","","",null,9,null,null,9,null,null,null,null,null,10]
[10,null,"",null,"","","",null,10,null,null,10,null,null,null,null,null,7]
[11,null,"",null,"","","",null,11,null,null,11,null,null,null,null,null,20]
[12,null,"",null,"","","",null,12,null,null,12,null,null,null,null,null,6]
[13,null,"",null,"","","",null,13,null,null,13,null,null,null,null,null,8]
[14,null,"",null,"","","",null,14,null,null,14,null,null,null,null,null,14]
[15,null,"",null,"","","",null,15,null,null,15,null,null,null,null,null,15]
[16,null,"",null,"","","",null,16,null,null,16,null,null,null,null,null,4]
[17,null,"",null,"","","",null,17,null,null,17,null,null,null,null,null,16]
[18,null,"",null,"","","",null,18,null,null,18,null,null,null,null,null,20]
[19,null,"",null,"","","",null,19,null,null,19,null,null,null,null,null,20]
[20,null,"",null,"","","",null,20,null,null,20,null,null,null,null,null,20]
[21,null,"",null,"","","",null,21,null,null,21,null,null,null,null,null,20]
[22,null,"",null,"","","",null,22,null,null,22,null,null,null,null,null,20]
[23,null,"",null,"","","",null,23,null,null,23,null,null,null,null,null,20]
[24,null,"",null,"",null,"",null,24,null,null,null,null,null,null,null,null,20]
[25,null,"",null,"",{"$f":"IF(ISBLANK(B39),\"\",VLOOKUP(B39,L$15:N$45,3))","v":""},"",null,25]
[26,null,"",null,"","","",null,26]
[27,null,"",null,"","","",null,27]
[28,null,"",null,"","","",null,28]
[29,null,"",null,"","","",null,29]
[30,null,"",null,"","","",null,30]
[null,null,null,null,"",null,null,null,31]
[]
["Non Starters","Non Starters",null,"Non Finishers","Non Finishers"]
[]
[]
[]
[]
[]
[null,null,"Comments:"]
["Sailing Time:",null,{"$f":"E15","v":""}]
["Fastest Time:",null,{"$f":"C15","v":""}]
["Margins:","1st - 2nd",{"$f":"D16-D15","v":"00:00:00"}]
[null,"2nd - 3rd",{"$f":"D17-D16","v":"00:00:00"}]

{"sheet":"16-11-14","index":4,"n_rows":57,"n_cols":18,"rows_kept":57,"cut":false,"hidden":false,"merged":[[9,0,9,1],[48,0,48,2],[48,3,48,7],[12,15,12,16],[12,0,12,1],[12,4,12,6],[47,0,47,2],[47,3,47,7],[46,3,46,7],[46,0,46,2],[0,0,0,7],[1,0,1,7],[3,0,3,1],[3,6,3,7],[7,0,7,1],[7,3,7,4],[7,5,7,7],[6,0,6,1],[52,3,55,7],[53,0,53,1],[54,0,54,1],[49,0,49,2],[49,3,49,7],[51,3,51,7],[50,0,50,2],[50,3,50,7],[51,0,51,2]]}
["Australian 18 Footers League"]
["Starters and Judges Report"]
[]
["Name of Race:",null,{"$f":"Schedule!$D7","v":"Chris Webb Memorial Trophy"},"Entrants:",{"$f":"Schedule!G7","v":17},"Date:",{"$f":"Schedule!B7","v":"2014-11-16"}]
[null,null,{"$f":"Schedule!$E7","v":"   "}]
[null,null,{"$f":"Schedule!$F7","v":""},null,null,null,null,null,null,null,null,null,"Ctrl+Shift+R to formulate H/cap result."]
["Course:",null,null,"Wind:",null,"Tide:"]
["Race Start Time:",null,null,"Race Finish Time :",null,{"$f":"D15","v":"00:00:00"}]
[]
["Start Mode:",null,{"$f":"IF(Schedule!C7=\"3b\",\"SCRATCH/3Buoy\",\"SCRATCH\")","v":"SCRATCH/3Buoy"}]
[null,"Non Starters:",0,"Non Finishers:",0]
[]
["Race Officer:",null,null,null,null,null,null,null,null,null,null,null,"Entrants",null,null,"Result"]
["Finish Placings","Recall #","Boat Name","Finish Time","Elapsed Time","Handicap","Corrected Time",{"$f":"IF(C10=\"Scratch\",\"H/cap Position\",\"Scratch Position\")","v":"Scratch Position"},null,null,null,"Recall #","Boat Name","H/CAP",null,"Scratch","H/Cap"]
[1,null,{"$f":"IF(ISBLANK(B15),\"\",VLOOKUP(B15,L$15:M$45,2))","v":""},null,{"$f":"IF(ISBLANK(D15),\"\",D15-C$8)","v":""},{"$f":"IF(ISBLANK(B15),\"\",VLOOKUP(B15,L$15:N$45,3))","v":""},{"$f":"IF(ISBLANK(D15),\"\",IF(C$10=\"Scratch\",E15-TIME(,F15,),E15))","v":""},null,1,null,null,1,null,null,null,null,null,1]
[2,null,"",null,"","","",null,2,null,null,2,null,null,null,null,null,5]
[3,null,"",null,"","","",null,3,null,null,3,null,null,null,null,null,11]
[4,null,"",null,"","","",null,4,null,null,4,null,null,null,null,null,10]
[5,null,"",null,"","","",null,5,null,null,5,null,null,null,null,null,2]
[6,null,"",null,"","","",null,6,null,null,6,null,null,null,null,null,6]
[7,null,"",null,"","","",null,7,null,null,7,null,null,null,null,null,20]
[8,null,"",null,"","","",null,8,null,null,8,null,null,null,null,null,12]
[9,null,"",null,"","","",null,9,null,null,9,null,null,null,null,null,20]
[10,null,"",null,"","","",null,10,null,null,10,null,null,null,null,null,7]
[11,null,"",null,"","","",null,11,null,null,11,null,null,null,null,null,8]
[12,null,"",null,"","","",null,12,null,null,12,null,null,null,null,null,3]
[13,null,"",null,"","","",null,13,null,null,13,null,null,null,null,null,13]
[14,null,"",null,"","","",null,14,null,null,14,null,null,null,null,null,4]
[15,null,"",null,"","","",null,15,null,null,15,null,null,null,null,null,9]
[16,null,"",null,"","","",null,16,null,null,16,null,null,null,null,null,20]
[17,null,"",null,"","","",null,17,null,null,17,null,null,null,null,null,15]
[18,null,"",null,"","","",null,18,null,null,18,null,null,null,null,null,20]
[19,null,"",null,"","","",null,19,null,null,19,null,null,null,null,null,14]
[20,null,"",null,"","","",null,20,null,null,20,null,null,null,null,null,20]
[21,null,"",null,"","","",null,21,null,null,21,null,null,null,null,null,20]
[22,null,"",null,"","","",null,22,null,null,22,null,null,null,null,null,20]
[23,null,"",null,"","","",null,23,null,null,23,null,null,null,null,null,20]
[24,null,"",null,"","","",null,24,null,null,null,null,null,null,null,null,20]
[25,null,"",null,"","","",null,25]
[26,null,"",null,"","","",null,26]
[27,null,"",null,"","","",null,27]
[28,null,"",null,"","","",null,28]
[29,null,"",null,"","","",null,29]
[30,null,"",null,"","","",null,30]
[null,null,null,null,"",null,null,null,31]
[]
["Non Starters","Non Starters",null,"Non Finishers","Non Finishers"]
[]
[]
[]
[]
[]
[null,null,"Comments:"]
["Sailing Time:",null,{"$f":"E15","v":""}]
["Fastest Time:",null,{"$f":"C15","v":""}]
["Margins:","1st - 2nd",{"$f":"D16-D15","v":"00:00:00"}]
[null,"2nd - 3rd",{"$f":"D17-D16","v":"00:00:00"}]

{"sheet":"23-11-14","index":5,"n_rows":57,"n_cols":18,"rows_kept":57,"cut":false,"hidden":false,"merged":[[9,0,9,1],[0,0,0,7],[1,0,1,7],[3,0,3,1],[3,6,3,7],[7,0,7,1],[7,3,7,4],[7,5,7,7],[6,0,6,1],[48,0,48,2],[48,3,48,7],[12,15,12,16],[12,0,12,1],[12,4,12,6],[47,0,47,2],[47,3,47,7],[46,0,46,2],[46,3,46,7],[52,3,55,7],[53,0,53,1],[54,0,54,1],[49,0,49,2],[49,3,49,7],[51,3,51,7],[50,0,50,2],[50,3,50,7],[51,0,51,2]]}
["Australian 18 Footers League"]
["Starters and Judges Report"]
[]
["Name of Race:",null,{"$f":"Schedule!$D8","v":"Club Championship – Race 3"},"Entrants:",{"$f":"Schedule!G8","v":17},"Date:",{"$f":"Schedule!B8","v":"2014-11-23"}]
[null,null,{"$f":"Schedule!$E8","v":"Cordukes Clubhouse Trophy"}]
[null,null,{"$f":"Schedule!$F8","v":""},null,null,null,null,null,null,null,null,null,"Ctrl+Shift+R to formulate H/cap result."]
["Course:",null,null,"Wind:",null,"Tide:"]
["Race Start Time:",null,null,"Race Finish Time :",null,{"$f":"D15","v":"00:00:00"}]
[]
["Start Mode:",null,{"$f":"IF(Schedule!C8=\"3b\",\"SCRATCH/3Buoy\",\"SCRATCH\")","v":"SCRATCH"}]
[null,"Non Starters:",0,"Non Finishers:",0]
[]
["Race Officer:",null,null,null,null,null,null,null,null,null,null,null,"Entrants",null,null,"Result"]
["Finish Placings","Recall #","Boat Name","Finish Time","Elapsed Time","Handicap","Corrected Time",{"$f":"IF(C10=\"Scratch\",\"H/cap Position\",\"Scratch Position\")","v":"H/cap Position"},null,null,null,"Recall #","Boat Name","H/CAP",null,"Scratch","H/Cap"]
[1,null,{"$f":"IF(ISBLANK(B15),\"\",VLOOKUP(B15,L$15:M$45,2))","v":""},null,{"$f":"IF(ISBLANK(D15),\"\",D15-C$8)","v":""},{"$f":"IF(ISBLANK(B15),\"\",VLOOKUP(B15,L$15:N$45,3))","v":""},{"$f":"IF(ISBLANK(D15),\"\",IF(C$10=\"Scratch\",E15-TIME(,F15,),E15))","v":""},null,1,null,null,1,null,null,null,null,null,4]
[2,null,"",null,"","","",null,2,null,null,2,null,null,null,null,null,6]
[3,null,"",null,"","","",null,3,null,null,3,null,null,null,null,null,2]
[4,null,"",null,"","","",null,4,null,null,4,null,null,null,null,null,13]
[5,null,"",null,"","","",null,5,null,null,5,null,null,null,null,null,12]
[6,null,"",null,"","","",null,6,null,null,6,null,null,null,null,null,20]
[7,null,"",null,"","","",null,7,null,null,7,null,null,null,null,null,11]
[8,null,"",null,"","","",null,8,null,null,8,null,null,null,null,null,7]
[9,null,"",null,"","","",null,9,null,null,9,null,null,null,null,null,20]
[10,null,"",null,"","","",null,10,null,null,10,null,null,null,null,null,5]
[11,null,"",null,"","","",null,11,null,null,11,null,null,null,null,null,3]
[12,null,"",null,"","","",null,12,null,null,12,null,null,null,null,null,20]
[13,null,"",null,"","","",null,13,null,null,13,null,null,null,null,null,1]
[14,null,"",null,"","","",null,14,null,null,14,null,null,null,null,null,9]
[15,null,"",null,"","","",null,15,null,null,15,null,null,null,null,null,8]
[16,null,"",null,"","","",null,16,null,null,16,null,null,null,null,null,10]
[17,null,"",null,"","","",null,17,null,null,17,null,null,null,null,null,15]
[18,null,"",null,"","","",null,18,null,null,18,null,null,null,null,null,20]
[19,null,"",null,"","","",null,19,null,null,19,null,null,null,null,null,14]
[20,null,"",null,"","","",null,20,null,null,20,null,null,null,null,null,20]
[21,null,"",null,"","","",null,21,null,null,21,null,null,null,null,null,20]
[22,null,"",null,"","","",null,22,null,null,22,null,null,null,null,null,20]
[23,null,"",null,"","","",null,23,null,null,23,null,null,null,null,null,20]
[24,null,"",null,"","","",null,24,null,null,null,null,null,null,null,null,20]
[25,null,"",null,"","","",null,25]
[26,null,"",null,"","","",null,26]
[27,null,"",null,"","","",null,27]
[28,null,"",null,"","","",null,28]
[29,null,"",null,"","","",null,29]
[30,null,"",null,"","","",null,30]
[null,null,null,null,"",null,null,null,31]
[]
["Non Starters","Non Starters",null,"Non Finishers","Non Finishers"]
[]
[]
[]
[]
[]
[null,null,"Comments:"]
["Sailing Time:",null,{"$f":"E15","v":""}]
["Fastest Time:",null,{"$f":"C15","v":""}]
["Margins:","1st - 2nd",{"$f":"D16-D15","v":"00:00:00"}]
[null,"2nd - 3rd",{"$f":"D17-D16","v":"00:00:00"}]

{"sheet":"30-11-14","index":6,"n_rows":57,"n_cols":18,"rows_kept":57,"cut":false,"hidden":false,"merged":[[9,0,9,1],[48,0,48,2],[48,3,48,7],[12,15,12,16],[12,0,12,1],[12,4,12,6],[47,0,47,2],[47,3,47,7],[46,3,46,7],[46,0,46,2],[0,0,0,7],[1,0,1,7],[3,0,3,1],[3,6,3,7],[7,0,7,1],[7,3,7,4],[7,5,7,7],[6,0,6,1],[53,0,53,1],[54,0,54,1],[49,0,49,2],[49,3,49,7],[51,3,51,7],[50,0,50,2],[50,3,50,7],[51,0,51,2],[52,3,56,7]]}
["Australian 18 Footers League"]
["Starters and Judges Report"]
[]
["Name of Race:",null,{"$f":"Schedule!$D9","v":"W.C. ‘Trappy’ Duncan Memorial Trophy"},"Entrants:",{"$f":"Schedule!G9","v":17},"Date:",{"$f":"Schedule!B9","v":"2014-11-30"}]
[null,null,{"$f":"Schedule!$E9","v":""}]
[]
["Course:",null,null,"Wind:",null,"Tide:",null,null,null,null,null,null,"Ctrl+Shift+R to formulate H/cap result."]
["Race Start Time:",null,null,"Race Finish Time :",null,{"$f":"D15","v":"00:00:00"}]
[]
["Start Mode:",null,{"$f":"IF(Schedule!C9=\"3b\",\"SCRATCH/3Buoy\",\"SCRATCH\")","v":"SCRATCH/3Buoy"}]
[null,"Non Starters:",0,"Non Finishers:",0]
[]
["Race Officer:",null,null,null,null,null,null,null,null,null,null,null,"Entrants",null,null,"Result"]
["Finish Placings","Recall #","Boat Name","Finish Time","Elapsed Time","Handicap","Corrected Time",{"$f":"IF(C10=\"Scratch\",\"H/cap Position\",\"Scratch Position\")","v":"Scratch Position"},null,null,null,"Recall #","Boat Name","H/CAP",null,"Scratch","H/Cap"]
[1,null,{"$f":"IF(ISBLANK(B15),\"\",VLOOKUP(B15,L$15:M$45,2))","v":""},null,{"$f":"IF(ISBLANK(D15),\"\",D15-C$8)","v":""},{"$f":"IF(ISBLANK(B15),\"\",VLOOKUP(B15,L$15:N$45,3))","v":""},{"$f":"IF(ISBLANK(D15),\"\",IF(C$10=\"Scratch\",E15-TIME(,F15,),E15))","v":""},null,1,null,null,1,null,null,null,null,null,9]
[2,null,"",null,"","","",null,2,null,null,2,null,null,null,null,null,7]
[3,null,"",null,"","","",null,3,null,null,3,null,null,null,null,null,4]
[4,null,"",null,"","","",null,4,null,null,4,null,null,null,null,null,12]
[5,null,"",null,"","","",null,5,null,null,5,null,null,null,null,null,6]
[6,null,"",null,"","","",null,6,null,null,6,null,null,null,null,null,1]
[7,null,"",null,"","","",null,7,null,null,7,null,null,null,null,null,15]
[8,null,"",null,"","","",null,8,null,null,8,null,null,null,null,null,8]
[9,null,"",null,"","","",null,9,null,null,9,null,null,null,null,null,20]
[10,null,"",null,"","","",null,10,null,null,10,null,null,null,null,null,13]
[11,null,"",null,"","","",null,11,null,null,11,null,null,null,null,null,2]
[12,null,"",null,"","","",null,12,null,null,12,null,null,null,null,null,11]
[13,null,"",null,"","","",null,13,null,null,13,null,null,null,null,null,5]
[14,null,"",null,"","","",null,14,null,null,14,null,null,null,null,null,20]
[15,null,"",null,"","","",null,15,null,null,15,null,null,null,null,null,16]
[16,null,"",null,"","","",null,16,null,null,16,null,null,null,null,null,3]
[17,null,"",null,"","","",null,17,null,null,17,null,null,null,null,null,14]
[18,null,"",null,"","","",null,18,null,null,18,null,null,null,null,null,17]
[19,null,"",null,"","","",null,19,null,null,19,null,null,null,null,null,10]
[20,null,"",null,"","","",null,20,null,null,20,null,null,null,null,null,20]
[21,null,"",null,"","","",null,21,null,null,21,null,null,null,null,null,20]
[22,null,"",null,"","","",null,22,null,null,22,null,null,null,null,null,20]
[23,null,"",null,"","","",null,23,null,null,23,null,null,null,null,null,20]
[24,null,"",null,"","","",null,24,null,null,null,null,null,null,null,null,20]
[25,null,"",null,"","","",null,25]
[26,null,"",null,"","","",null,26]
[27,null,"",null,"","","",null,27]
[28,null,"",null,"","","",null,28]
[29,null,"",null,"","","",null,29]
[30,null,"",null,"","","",null,30]
[null,null,null,null,"",null,null,null,31]
[]
["Non Starters","Non Starters",null,"Non Finishers","Non Finishers"]
[]
[]
[]
[]
[]
[null,null,"Comments:"]
["Sailing Time:",null,{"$f":"E15","v":""}]
["Fastest Time:",null,{"$f":"C15","v":""}]
["Margins:","1st - 2nd",{"$f":"D16-D15","v":"00:00:00"}]
[null,"2nd - 3rd",{"$f":"D17-D16","v":"00:00:00"}]

{"sheet":"7-12-14","index":7,"n_rows":57,"n_cols":18,"rows_kept":57,"cut":false,"hidden":false,"merged":[[9,0,9,1],[0,0,0,7],[1,0,1,7],[3,0,3,1],[3,6,3,7],[7,0,7,1],[7,3,7,4],[7,5,7,7],[6,0,6,1],[48,0,48,2],[48,3,48,7],[12,15,12,16],[12,0,12,1],[12,4,12,6],[47,0,47,2],[47,3,47,7],[46,0,46,2],[46,3,46,7],[52,3,55,7],[53,0,53,1],[54,0,54,1],[49,0,49,2],[49,3,49,7],[51,3,51,7],[50,0,50,2],[50,3,50,7],[51,0,51,2]]}
["Australian 18 Footers League"]
["Starters and Judges Report"]
[]
["Name of Race:",null,{"$f":"Schedule!$D10","v":"Club Championship – Race 4"},"Entrants:",{"$f":"Schedule!G10","v":17},"Date:",{"$f":"Schedule!B10","v":"2014-12-07"}]
[null,null,{"$f":"Schedule!$E10","v":"YANDOO Trophy"}]
[null,null,{"$f":"Schedule!$F10","v":""}]
["Course:",null,null,"Wind:",null,"Tide:",null,null,null,null,null,null,"Ctrl+Shift+R to formulate H/cap result."]
["Race Start Time:",null,null,"Race Finish Time :",null,{"$f":"D15","v":"00:00:00"}]
[]
["Start Mode:",null,{"$f":"IF(Schedule!C10=\"3b\",\"SCRATCH/3Buoy\",\"SCRATCH\")","v":"SCRATCH"}]
[null,"Non Starters:",0,"Non Finishers:",0]
[]
["Race Officer:",null,null,null,null,null,null,null,null,null,null,null,"Entrants",null,null,"Result"]
["Finish Placings","Recall #","Boat Name","Finish Time","Elapsed Time","Handicap","Corrected Time",{"$f":"IF(C10=\"Scratch\",\"H/cap Position\",\"Scratch Position\")","v":"H/cap Position"},null,null,null,"Recall #","Boat Name","H/CAP",null,"Scratch","H/Cap"]
[1,null,{"$f":"IF(ISBLANK(B15),\"\",VLOOKUP(B15,L$15:M$45,2))","v":""},null,{"$f":"IF(ISBLANK(D15),\"\",D15-C$8)","v":""},{"$f":"IF(ISBLANK(B15),\"\",VLOOKUP(B15,L$15:N$45,3))","v":""},{"$f":"IF(ISBLANK(D15),\"\",IF(C$10=\"Scratch\",E15-TIME(,F15,),E15))","v":""},null,1,null,null,1,null,null,null,null,null,20]
[2,null,"",null,"","","",null,2,null,null,2,null,null,null,null,null,9]
[3,null,"",null,"","","",null,3,null,null,3,null,null,null,null,null,20]
[4,null,"",null,"","","",null,4,null,null,4,null,null,null,null,null,8]
[5,null,"",null,"","","",null,5,null,null,5,null,null,null,null,null,20]
[6,null,"",null,"","","",null,6,null,null,6,null,null,null,null,null,3]
[7,null,"",null,"","","",null,7,null,null,7,null,null,null,null,null,1]
[8,null,"",null,"","","",null,8,null,null,8,null,null,null,null,null,5]
[9,null,"",null,"","","",null,9,null,null,9,null,null,null,null,null,4]
[10,null,"",null,"","","",null,10,null,null,10,null,null,null,null,null,6]
[11,null,"",null,"","","",null,11,null,null,11,null,null,null,null,null,2]
[12,null,"",null,"","","",null,12,null,null,12,null,null,null,null,null,20]
[13,null,"",null,"","","",null,13,null,null,13,null,null,null,null,null,10]
[14,null,"",null,"","","",null,14,null,null,14,null,null,null,null,null,20]
[15,null,"",null,"","","",null,15,null,null,15,null,null,null,null,null,20]
[16,null,"",null,"","","",null,16,null,null,16,null,null,null,null,null,7]
[17,null,"",null,"","","",null,17,null,null,17,null,null,null,null,null,20]
[18,null,"",null,"","","",null,18,null,null,18,null,null,null,null,null,20]
[19,null,"",null,"","","",null,19,null,null,19,null,null,null,null,null,20]
[20,null,"",null,"","","",null,20,null,null,20,null,null,null,null,null,20]
[21,null,"",null,"","","",null,21,null,null,21,null,null,null,null,null,20]
[22,null,"",null,"","","",null,22,null,null,22,null,null,null,null,null,20]
[23,null,"",null,"","","",null,23,null,null,23,null,null,null,null,null,20]
[24,null,"",null,"","","",null,24,null,null,null,null,null,null,null,null,20]
[25,null,"",null,"","","",null,25]
[26,null,"",null,"","","",null,26]
[27,null,"",null,"","","",null,27]
[28,null,"",null,"","","",null,28]
[29,null,"",null,"","","",null,29]
[30,null,"",null,"","","",null,30]
[null,null,null,null,"",null,null,null,31]
[]
["Non Starters","Non Starters",null,"Non Finishers","Non Finishers"]
[]
[]
[]
[]
[]
[null,null,"Comments:"]
["Sailing Time:",null,{"$f":"E15","v":""}]
["Fastest Time:",null,{"$f":"C15","v":""}]
["Margins:","1st - 2nd",{"$f":"D16-D15","v":"00:00:00"}]
[null,"2nd - 3rd",{"$f":"D17-D16","v":"00:00:00"}]

{"sheet":"14-12-14","index":8,"n_rows":57,"n_cols":18,"rows_kept":57,"cut":false,"hidden":false,"merged":[[9,0,9,1],[48,0,48,2],[48,3,48,7],[12,15,12,16],[12,0,12,1],[12,4,12,6],[47,0,47,2],[47,3,47,7],[46,3,46,7],[46,0,46,2],[0,0,0,7],[1,0,1,7],[3,0,3,1],[3,6,3,7],[7,0,7,1],[7,3,7,4],[7,5,7,7],[6,0,6,1],[52,3,55,7],[53,0,53,1],[54,0,54,1],[49,0,49,2],[49,3,49,7],[51,3,51,7],[50,0,50,2],[50,3,50,7],[51,0,51,2]]}
["Australian 18 Footers League"]
["Starters and Judges Report"]
[]
["Name of Race:",null,{"$f":"Schedule!$D11","v":"Syd. Barnett Jr. Memorial Trophy"},"Entrants:",{"$f":"Schedule!G11","v":17},"Date:",{"$f":"Schedule!B11","v":"2014-12-14"}]
[null,null,{"$f":"Schedule!$E11","v":0}]
[null,null,{"$f":"Schedule!$F11","v":""}]
["Course:",null,null,"Wind:",null,"Tide:"]
["Race Start Time:",null,null,"Race Finish Time :",null,{"$f":"D15","v":"00:00:00"},null,null,null,null,null,null,"Ctrl+Shift+R to formulate H/cap result."]
[]
["Start Mode:",null,{"$f":"IF(Schedule!C11=\"3b\",\"SCRATCH/3Buoy\",\"SCRATCH\")","v":"SCRATCH/3Buoy"}]
[null,"Non Starters:",0,"Non Finishers:",0]
[]
["Race Officer:",null,null,null,null,null,null,null,null,null,null,null,"Entrants",null,null,"Result"]
["Finish Placings","Recall #","Boat Name","Finish Time","Elapsed Time","Handicap","Corrected Time",{"$f":"IF(C10=\"Scratch\",\"H/cap Position\",\"Scratch Position\")","v":"Scratch Position"},null,null,null,"Recall #","Boat Name","H/CAP",null,"Scratch","H/Cap"]
[1,null,{"$f":"IF(ISBLANK(B15),\"\",VLOOKUP(B15,L$15:M$45,2))","v":""},null,{"$f":"IF(ISBLANK(D15),\"\",D15-C$8)","v":""},{"$f":"IF(ISBLANK(B15),\"\",VLOOKUP(B15,L$15:N$45,3))","v":""},{"$f":"IF(ISBLANK(D15),\"\",IF(C$10=\"Scratch\",E15-TIME(,F15,),E15))","v":""},null,1,null,null,1,null,null,null,null,null,6]
[2,null,"",null,"","","",null,2,null,null,2,null,null,null,null,null,9]
[3,null,"",null,"","","",null,3,null,null,3,null,null,null,null,null,7]
[4,null,"",null,"","","",null,4,null,null,4,null,null,null,null,null,11]
[5,null,"",null,"","","",null,5,null,null,5,null,null,null,null,null,20]
[6,null,"",null,"","","",null,6,null,null,6,null,null,null,null,null,5]
[7,null,"",null,"","","",null,7,null,null,7,null,null,null,null,null,1]
[8,null,"",null,"","","",null,8,null,null,8,null,null,null,null,null,3]
[9,null,"",null,"","","",null,9,null,null,9,null,null,null,null,null,13]
[10,null,"",null,"","","",null,11,null,null,10,null,null,null,null,null,4]
[11,null,"",null,"","","",null,11,null,null,11,null,null,null,null,null,12]
[12,null,"",null,"","","",null,12,null,null,12,null,null,null,null,null,8]
[13,null,"",null,"","","",null,13,null,null,13,null,null,null,null,null,20]
[14,null,"",null,"","",{"$f":"IF(ISBLANK(D28),\"\",IF(C$11=\"Scratch\",E28-TIME(,F28,),E28))","v":""},null,14,null,null,14,null,null,null,null,null,11]
[15,null,"",null,"","",{"$f":"IF(ISBLANK(D29),\"\",IF(C$11=\"Scratch\",E29-TIME(,F29,),E29))","v":""},null,15,null,null,15,null,null,null,null,null,15]
[16,null,"",null,"","",{"$f":"IF(ISBLANK(D30),\"\",IF(C$11=\"Scratch\",E30-TIME(,F30,),E30))","v":""},null,16,null,null,16,null,null,null,null,null,2]
[17,null,null,null,null,null,null,null,17,null,null,17,null,null,null,null,null,14]
[18,null,{"$f":"IF(ISBLANK(B32),\"\",VLOOKUP(B32,L$15:M$45,2))","v":""},null,{"$f":"IF(ISBLANK(D32),\"\",D32-C$8)","v":""},{"$f":"IF(ISBLANK(B32),\"\",VLOOKUP(B32,L$15:N$45,3))","v":""},{"$f":"IF(ISBLANK(D32),\"\",IF(C$11=\"Scratch\",E32-TIME(,F32,),E32))","v":""},null,18,null,null,18,null,null,null,null,null,20]
[19,null,"",null,"","","",null,19,null,null,19,null,null,null,null,null,16]
[20,null,"",null,"","","",null,20,null,null,20,null,null,null,null,null,20]
[21,null,"",null,"","","",null,21,null,null,21,null,null,null,null,null,20]
[22,null,"",null,"","","",null,22,null,null,22,null,null,null,null,null,20]
[23,null,"",null,"","","",null,23,null,null,23,null,null,null,null,null,20]
[24,null,"",null,"","","",null,24,null,null,null,null,null,null,null,null,20]
[25,null,"",null,"","","",null,25]
[26,null,"",null,"","","",null,26]
[27,null,"",null,"","","",null,27]
[28,null,"",null,"","","",null,28]
[29,null,"",null,"","","",null,29]
[30,null,"",null,"","","",null,30]
[null,null,null,null,"",null,null,null,31]
[]
["Non Starters","Non Starters",null,"Non Finishers","Non Finishers"]
[]
[]
[]
[]
[]
[null,null,"Comments:"]
["Sailing Time:",null,{"$f":"E15","v":""}]
["Fastest Time:",null,{"$f":"C15","v":""}]
["Margins:","1st - 2nd",{"$f":"D16-D15","v":"00:00:00"}]
[null,"2nd - 3rd",{"$f":"D17-D16","v":"00:00:00"}]

{"sheet":"11-01-15","index":9,"n_rows":57,"n_cols":18,"rows_kept":57,"cut":false,"hidden":false,"merged":[[9,0,9,1],[0,0,0,7],[1,0,1,7],[3,0,3,1],[3,6,3,7],[7,0,7,1],[7,3,7,4],[7,5,7,7],[6,0,6,1],[48,0,48,2],[48,3,48,7],[12,15,12,16],[12,0,12,1],[12,4,12,6],[47,0,47,2],[47,3,47,7],[46,0,46,2],[46,3,46,7],[52,3,55,7],[53,0,53,1],[54,0,54,1],[49,0,49,2],[49,3,49,7],[51,3,51,7],[50,0,50,2],[50,3,50,7],[51,0,51,2]]}
["Australian 18 Footers League"]
["Starters and Judges Report"]
[]
["Name of Race:",null,{"$f":"Schedule!$E12","v":"Club Championship – Race 5"},"Entrants:",{"$f":"Schedule!G12","v":17},"Date:",{"$f":"Schedule!B12","v":"2015-01-11"}]
[null,null,{"$f":"Schedule!$D12","v":"NSW Championship – Race 1"}]
[null,null,{"$f":"Schedule!$F12","v":""}]
["Course:",null,null,"Wind:",null,"Tide:"]
["Race Start Time:",null,null,"Race Finish Time :",null,{"$f":"D15","v":"00:00:00"},null,null,null,null,null,null,"Ctrl+Shift+R to formulate H/cap result."]
[]
["Start Mode:",null,{"$f":"IF(Schedule!C12=\"3b\",\"SCRATCH/3Buoy\",\"SCRATCH\")","v":"SCRATCH"}]
[null,"Non Starters:",0,"Non Finishers:",0]
[]
["Race Officer:",null,null,null,null,null,null,null,null,null,null,null,"Entrants",null,null,"Result"]
["Finish Placings","Recall #","Boat Name","Finish Time","Elapsed Time","Handicap","Corrected Time",{"$f":"IF(C10=\"Scratch\",\"H/cap Position\",\"Scratch Position\")","v":"H/cap Position"},null,null,null,"Recall #","Boat Name","H/CAP",null,"Scratch","H/Cap"]
[1,null,{"$f":"IF(ISBLANK(B15),\"\",VLOOKUP(B15,L$15:M$45,2))","v":""},null,{"$f":"IF(ISBLANK(D15),\"\",D15-C$8)","v":""},{"$f":"IF(ISBLANK(B15),\"\",VLOOKUP(B15,L$15:N$45,3))","v":""},{"$f":"IF(ISBLANK(D15),\"\",IF(C$10=\"Scratch\",E15-TIME(,F15,),E15))","v":""},null,1,null,null,1,null,null,null,null,null,3]
[2,null,"",null,"","","",null,2,null,null,2,null,null,null,null,null,11]
[3,null,"",null,"","","",null,3,null,null,3,null,null,null,null,null,1]
[4,null,"",null,"","","",null,4,null,null,4,null,null,null,null,null,13]
[5,null,"",null,"","","",null,5,null,null,5,null,null,null,null,null,9]
[6,null,"",null,"","","",null,6,null,null,6,null,null,null,null,null,7]
[7,null,"",null,"","","",null,7,null,null,7,null,null,null,null,null,6]
[8,null,"",null,"","","",null,8,null,null,8,null,null,null,null,null,5]
[9,null,"",null,"","","",null,9,null,null,9,null,null,null,null,null,10]
[10,null,"",null,"","","",null,10,null,null,10,null,null,null,null,null,12]
[11,null,"",null,"","","",null,11,null,null,11,null,null,null,null,null,4]
[12,null,"",null,"","","",null,12,null,null,12,null,null,null,null,null,2]
[13,null,"",null,"","","",null,13,null,null,13,null,null,null,null,null,15]
[14,null,"",null,"","","",null,14,null,null,14,null,null,null,null,null,17]
[15,null,"",null,"","","",null,15,null,null,15,null,null,null,null,null,20]
[16,null,"",null,"","","",null,16,null,null,16,null,null,null,null,null,8]
[17,null,"",null,"","","",null,17,null,null,17,null,null,null,null,null,16]
[18,null,"",null,"","","",null,18,null,null,18,null,null,null,null,null,14]
[19,null,"",null,"","","",null,19,null,null,19,null,null,null,null,null,18]
[20,null,"",null,"","","",null,20,null,null,20,null,null,null,null,null,20]
[21,null,"",null,"","","",null,21,null,null,21,null,null,null,null,null,20]
[22,null,"",null,"","","",null,22,null,null,22,null,null,null,null,null,20]
[23,null,"",null,"","","",null,23,null,null,23,null,null,null,null,null,20]
[24,null,"",null,"","","",null,24,null,null,24,null,null,null,null,null,20]
[25,null,"",null,"","","",null,25]
[26,null,"",null,"","","",null,26]
[27,null,"",null,"","","",null,27]
[28,null,"",null,"","","",null,28]
[29,null,"",null,"","","",null,29]
[30,null,"",null,"","","",null,30]
[null,null,null,null,"",null,null,null,31]
[null,null,null,null,null,null,null,null,null,null,null,null,null,null,null,{"$f":"P45 +1","v":1}]
["Non Starters","Non Starters",null,"Non Finishers","Non Finishers",null,null,null,null,null,null,null,null,null,null,{"$f":"P46 +1","v":2}]
[]
[]
[]
[]
[]
[null,null,"Comments:"]
["Sailing Time:",null,{"$f":"E15","v":""}]
["Fastest Time:",null,{"$f":"C15","v":""}]
["Margins:","1st - 2nd",{"$f":"D16-D15","v":"00:00:00"}]
[null,"2nd - 3rd",{"$f":"D17-D16","v":"00:00:00"}]

{"sheet":"18-01-15","index":10,"n_rows":57,"n_cols":18,"rows_kept":57,"cut":false,"hidden":false,"merged":[[9,0,9,1],[48,0,48,2],[48,3,48,7],[12,15,12,16],[12,0,12,1],[12,4,12,6],[47,0,47,2],[47,3,47,7],[46,3,46,7],[46,0,46,2],[0,0,0,7],[1,0,1,7],[3,0,3,1],[3,6,3,7],[7,0,7,1],[7,3,7,4],[7,5,7,7],[6,0,6,1],[52,3,55,7],[53,0,53,1],[54,0,54,1],[49,0,49,2],[49,3,49,7],[51,3,51,7],[50,0,50,2],[50,3,50,7],[51,0,51,2]]}
["Australian 18 Footers League"]
["Starters and Judges Report"]
[]
["Name of Race:",null,{"$f":"Schedule!$D13","v":"NSW Championship – Race 2"},"Entrants:",{"$f":"Schedule!G13","v":17},"Date:",{"$f":"Schedule!B13","v":"2015-01-18"}]
[null,null,{"$f":"Schedule!$E13","v":"Club Championship – Race 6"}]
[null,null,{"$f":"Schedule!F13","v":""}]
["Course:",null,null,"Wind:",null,"Tide:"]
["Race Start Time:",null,null,"Race Finish Time :",null,{"$f":"D15","v":"00:00:00"},null,null,null,null,null,null,"Ctrl+Shift+R to formulate H/cap result."]
[]
["Start Mode:",null,{"$f":"IF(Schedule!C13=\"3b\",\"SCRATCH/3Buoy\",\"SCRATCH\")","v":"SCRATCH"}]
[null,"Non Starters:",0,"Non Finishers:",0]
[]
["Race Officer:",null,null,null,null,null,null,null,null,null,null,null,"Entrants",null,null,"Result"]
["Finish Placings","Recall #","Boat Name","Finish Time","Elapsed Time","Handicap","Corrected Time",{"$f":"IF(C10=\"Scratch\",\"H/cap Position\",\"Scratch Position\")","v":"H/cap Position"},null,null,null,"Recall #","Boat Name","H/CAP",null,"Scratch","H/Cap"]
[1,null,{"$f":"IF(ISBLANK(B15),\"\",VLOOKUP(B15,L$15:M$45,2))","v":""},null,{"$f":"IF(ISBLANK(D15),\"\",D15-C$8)","v":""},{"$f":"IF(ISBLANK(B15),\"\",VLOOKUP(B15,L$15:N$45,3))","v":""},{"$f":"IF(ISBLANK(D15),\"\",IF(C$10=\"Scratch\",E15-TIME(,F15,),E15))","v":""},null,1,null,null,1,null,null,null,null,null,2]
[2,null,"",null,"","","",null,2,null,null,2,null,null,null,null,null,10]
[3,null,"",null,"","","",null,3,null,null,3,null,null,null,null,null,7]
[4,null,"",null,"","","",null,4,null,null,4,null,null,null,null,null,13]
[5,null,"",null,"","","",null,5,null,null,5,null,null,null,null,null,5]
[6,null,"",null,"","","",null,6,null,null,6,null,null,null,null,null,4]
[7,null,"",null,"","","",null,7,null,null,7,null,null,null,null,null,1]
[8,null,"",null,"","","",null,8,null,null,8,null,null,null,null,null,3]
[9,null,"",null,"","","",null,9,null,null,9,null,null,null,null,null,11]
[10,null,"",null,"","","",null,10,null,null,10,null,null,null,null,null,8]
[11,null,"",null,"","","",null,11,null,null,11,null,null,null,null,null,12]
[12,null,"",null,"","","",null,12,null,null,12,null,null,null,null,null,9]
[13,null,"",null,"","","",null,13,null,null,13,null,null,null,null,null,20]
[14,null,"",null,"","","",null,14,null,null,14,null,null,null,null,null,14]
[15,null,"",null,"","","",null,15,null,null,15,null,null,null,null,null,15]
[16,null,"",null,"","","",null,16,null,null,16,null,null,null,null,null,6]
[17,null,"",null,"","","",null,17,null,null,17,null,null,null,null,null,16]
[18,null,"",null,"","","",null,18,null,null,18,null,null,null,null,null,20]
[19,null,"",null,"","","",null,19,null,null,19,null,null,null,null,null,20]
[20,null,"",null,"","","",null,20,null,null,20,null,null,null,null,null,20]
[21,null,"",null,"","","",null,21,null,null,21,null,null,null,null,null,20]
[22,null,"",null,"","","",null,22,null,null,22,null,null,null,null,null,20]
[23,null,"",null,"","","",null,23,null,null,23,null,null,null,null,null,20]
[24,null,"",null,"","","",null,24,null,null,24,null,null,null,null,null,20]
[25,null,"",null,"","","",null,25]
[26,null,"",null,"","","",null,26]
[27,null,"",null,"","","",null,27]
[28,null,"",null,"","","",null,28]
[29,null,"",null,"","","",null,29]
[30,null,"",null,"","","",null,30]
[null,null,null,null,null,null,null,null,31]
[]
["Non Starters","Non Starters",null,"Non Finishers","Non Finishers"]
[]
[]
[]
[]
[]
[null,null,"Comments:"]
["Sailing Time:",null,{"$f":"E15","v":""}]
["Fastest Time:",null,{"$f":"C15","v":""}]
["Margins:","1st - 2nd",{"$f":"D16-D15","v":"00:00:00"}]
[null,"2nd - 3rd",{"$f":"D17-D16","v":"00:00:00"}]

{"sheet":"25-01-15","index":11,"n_rows":57,"n_cols":18,"rows_kept":57,"cut":false,"hidden":false,"merged":[[9,0,9,1],[48,0,48,2],[48,3,48,7],[12,15,12,16],[12,0,12,1],[12,4,12,6],[47,0,47,2],[47,3,47,7],[46,3,46,7],[46,0,46,2],[0,0,0,7],[1,0,1,7],[3,0,3,1],[3,6,3,7],[7,0,7,1],[7,3,7,4],[7,5,7,7],[6,0,6,1],[52,3,55,7],[53,0,53,1],[54,0,54,1],[49,0,49,2],[49,3,49,7],[51,3,51,7],[50,0,50,2],[50,3,50,7],[51,0,51,2]]}
["Australian 18 Footers League"]
["Starters and Judges Report"]
[]
["Name of Race:",null,{"$f":"Schedule!$D14","v":"NSW Championship – Race 3"},"Entrants:",{"$f":"Schedule!G14","v":17},"Date:",{"$f":"Schedule!B14","v":"2015-01-25"}]
[null,null,{"$f":"Schedule!$E14","v":"Club Championship – Race 7"}]
[null,null,{"$f":"Schedule!$F15","v":"Lord Mayor's Trophy"}]
["Course:",null,null,"Wind:",null,"Tide:"]
["Race Start Time:",null,null,"Race Finish Time :",null,{"$f":"D15","v":"00:00:00"},null,null,null,null,null,null,"Ctrl+Shift+R to formulate H/cap result."]
[]
["Start Mode:",null,{"$f":"IF(Schedule!C14=\"3b\",\"SCRATCH/3Buoy\",\"SCRATCH\")","v":"SCRATCH"}]
[null,"Non Starters:",0,"Non Finishers:",0]
[]
["Race Officer:",null,null,null,null,null,null,null,null,null,null,null,"Entrants",null,null,"Result"]
["Finish Placings","Recall #","Boat Name","Finish Time","Elapsed Time","Handicap","Corrected Time",{"$f":"IF(C10=\"Scratch\",\"H/cap Position\",\"Scratch Position\")","v":"H/cap Position"},null,null,null,"Recall #","Boat Name","H/CAP",null,"Scratch","H/Cap"]
[1,null,{"$f":"IF(ISBLANK(B15),\"\",VLOOKUP(B15,L$15:M$45,2))","v":""},null,{"$f":"IF(ISBLANK(D15),\"\",D15-C$8)","v":""},{"$f":"IF(ISBLANK(B15),\"\",VLOOKUP(B15,L$15:N$45,3))","v":""},{"$f":"IF(ISBLANK(D15),\"\",IF(C$10=\"Scratch\",E15-TIME(,F15,),E15))","v":""},null,1,null,null,1,null,null,null,null,null,2]
[2,null,"",null,"","","",null,2,null,null,2,null,null,null,null,null,12]
[3,null,"",null,"","","",null,3,null,null,3,null,null,null,null,null,4]
[4,null,"",null,"","","",null,4,null,null,4,null,null,null,null,null,20]
[5,null,"",null,"","","",null,5,null,null,5,null,null,null,null,null,8]
[6,null,"",null,"","","",null,6,null,null,6,null,null,null,null,null,3]
[7,null,"",null,"","","",null,7,null,null,7,null,null,null,null,null,20]
[8,null,"",null,"","","",null,8,null,null,8,null,null,null,null,null,20]
[9,null,"",null,"","","",null,9,null,null,9,null,null,null,null,null,9]
[10,null,"",null,"","","",null,10,null,null,10,null,null,null,null,null,6]
[11,null,"",null,"","","",null,11,null,null,11,null,null,null,null,null,1]
[12,null,"",null,"","","",null,12,null,null,12,null,null,null,null,null,5]
[13,null,"",null,"","","",null,13,null,null,13,null,null,null,null,null,11]
[14,null,"",null,"","","",null,14,null,null,14,null,null,null,null,null,7]
[15,null,"",null,"","","",null,15,null,null,15,null,null,null,null,null,10]
[16,null,"",null,"","","",null,16,null,null,16,null,null,null,null,null,13]
[17,null,"",null,"","","",null,17,null,null,17,null,null,null,null,null,14]
[18,null,"",null,"","","",null,18,null,null,18,null,null,null,null,null,20]
[19,null,"",null,"","","",null,19,null,null,19,null,null,null,null,null,15]
[20,null,"",null,"","","",null,20,null,null,20,null,null,null,null,null,20]
[21,null,"",null,"","","",null,21,null,null,21,null,null,null,null,null,20]
[22,null,"",null,"","","",null,22,null,null,22,null,null,null,null,null,20]
[23,null,"",null,"","","",null,23,null,null,23,null,null,null,null,null,20]
[24,null,"",null,"","","",null,24,null,null,24,null,null,null,null,null,20]
[25,null,"",null,"","","",null,25,null,null,25]
[26,null,"",null,"","","",null,26]
[27,null,"",null,"","","",null,27]
[28,null,"",null,"","","",null,28]
[29,null,"",null,"","","",null,29]
[30,null,"",null,"","","",null,31]
[31,null,"",null,"","","",null,30]
[]
["Non Starters","Non Starters",null,"Non Finishers","Non Finishers"]
[]
[]
[]
[]
[]
[null,null,"Comments:"]
["Sailing Time:",null,{"$f":"E15","v":""}]
["Fastest Time:",null,{"$f":"C15","v":""}]
["Margins:","1st - 2nd",{"$f":"D16-D15","v":"00:00:00"}]
[null,"2nd - 3rd",{"$f":"D17-D16","v":"00:00:00"}]

{"sheet":"26-01-15","index":12,"n_rows":57,"n_cols":18,"rows_kept":57,"cut":false,"hidden":false,"merged":[[9,0,9,1],[48,0,48,2],[48,3,48,7],[12,15,12,16],[12,0,12,1],[12,4,12,6],[47,0,47,2],[47,3,47,7],[46,3,46,7],[46,0,46,2],[0,0,0,7],[1,0,1,7],[3,0,3,1],[3,6,3,7],[7,0,7,1],[7,3,7,4],[7,5,7,7],[6,0,6,1],[52,3,55,7],[53,0,53,1],[54,0,54,1],[49,0,49,2],[49,3,49,7],[51,3,51,7],[50,0,50,2],[50,3,50,7],[51,0,51,2]]}
["Australian 18 Footers League"]
["Starters and Judges Report"]
[]
["Name of Race:",null,{"$f":"Schedule!$D15","v":"NSW Championship – Race 4"},"Entrants:",{"$f":"Schedule!G15","v":17},"Date:",{"$f":"Schedule!B15","v":"2015-01-26"}]
[null,null,{"$f":"Schedule!$E15","v":"Club Championship – Race 8"}]
[null,null,{"$f":"Schedule!$E19","v":"Commodore Cup"}]
["Course:",null,null,"Wind:",null,"Tide:"]
["Race Start Time:",null,null,"Race Finish Time :",null,{"$f":"D15","v":"00:00:00"},null,null,null,null,null,null,"Ctrl+Shift+R to formulate H/cap result."]
[]
["Start Mode:",null,{"$f":"IF(Schedule!C15=\"3b\",\"SCRATCH/3Buoy\",\"SCRATCH\")","v":"SCRATCH"}]
[null,"Non Starters:",0,"Non Finishers:",0]
[]
["Race Officer:",null,null,null,null,null,null,null,null,null,null,null,"Entrants",null,null,"Result"]
["Finish Placings","Recall #","Boat Name","Finish Time","Elapsed Time","Handicap","Corrected Time",{"$f":"IF(C10=\"Scratch\",\"H/cap Position\",\"Scratch Position\")","v":"H/cap Position"},null,null,null,"Recall #","Boat Name","H/CAP",null,"Scratch","H/Cap"]
[1,null,{"$f":"IF(ISBLANK(B15),\"\",VLOOKUP(B15,L$15:M$45,2))","v":""},null,{"$f":"IF(ISBLANK(D15),\"\",D15-C$8)","v":""},{"$f":"IF(ISBLANK(B15),\"\",VLOOKUP(B15,L$15:N$45,3))","v":""},{"$f":"IF(ISBLANK(D15),\"\",IF(C$10=\"Scratch\",E15-TIME(,F15,),E15))","v":""},null,1,null,null,1,null,null,null,null,null,3]
[2,null,"",null,"","","",null,2,null,null,2,null,null,null,null,null,14]
[3,null,"",null,"","","",null,3,null,null,3,null,null,null,null,null,5]
[4,null,"",null,"","","",null,4,null,null,4,null,null,null,null,null,8]
[5,null,"",null,"","","",null,5,null,null,5,null,null,null,null,null,10]
[6,null,"",null,"","","",null,6,null,null,6,null,null,null,null,null,4]
[7,null,"",null,"","","",null,7,null,null,7,null,null,null,null,null,1]
[8,null,"",null,"","","",null,8,null,null,8,null,null,null,null,null,9]
[9,null,"",null,"","","",null,9,null,null,9,null,null,null,null,null,13]
[10,null,"",null,"","","",null,10,null,null,10,null,null,null,null,null,6]
[11,null,"",null,"","","",null,11,null,null,11,null,null,null,null,null,2]
[12,null,"",null,"","","",null,12,null,null,12,null,null,null,null,null,7]
[13,null,"",null,"","","",null,13,null,null,13,null,null,null,null,null,11]
[14,null,"",null,"","","",null,14,null,null,14,null,null,null,null,null,20]
[15,null,"",null,"","","",null,15,null,null,15,null,null,null,null,null,15]
[16,null,"",null,"","","",null,16,null,null,16,null,null,null,null,null,12]
[17,null,"",null,"","","",null,17,null,null,17,null,null,null,null,null,16]
[18,null,"",null,"","","",null,18,null,null,18,null,null,null,null,null,20]
[19,null,"",null,"","","",null,19,null,null,19,null,null,null,null,null,20]
[20,null,null,null,"","","",null,20,null,null,20,null,null,null,null,null,20]
[21,null,{"$f":"IF(ISBLANK(B35),\"\",VLOOKUP(B35,L$15:M$45,2))","v":""},null,"","","",null,21,null,null,21,null,null,null,null,null,20]
[22,null,"",null,"","","",null,22,null,null,22,null,null,null,null,null,20]
[23,null,"",null,"","","",null,23,null,null,23,null,null,null,null,null,20]
[24,null,"",null,"","","",null,24,null,null,24,null,null,null,null,null,20]
[25,null,"",null,"","","",null,25]
[26,null,"",null,"","","",null,26]
[27,null,"",null,"","","",null,27]
[28,null,"",null,"","","",null,28]
[29,null,"",null,"","","",null,29]
["Visitor",null,"CST Composites",null,"",null,null,null,30]
["Visitor",null,null,null,null,null,null,null,31]
[]
["Non Starters","Non Starters",null,"Non Finishers","Non Finishers"]
[]
[]
[]
[]
[]
[null,null,"Comments:"]
["Sailing Time:",null,{"$f":"E15","v":""}]
["Fastest Time:",null,{"$f":"C15","v":""}]
["Margins:","1st - 2nd",{"$f":"D16-D15","v":"00:00:00"}]
[null,"2nd - 3rd",{"$f":"D17-D16","v":"00:00:00"}]

{"sheet":"1-02-15","index":13,"n_rows":57,"n_cols":18,"rows_kept":57,"cut":false,"hidden":false,"merged":[[9,0,9,1],[0,0,0,7],[1,0,1,7],[3,0,3,1],[3,6,3,7],[7,0,7,1],[7,3,7,4],[7,5,7,7],[6,0,6,1],[48,0,48,2],[48,3,48,7],[12,15,12,16],[12,0,12,1],[12,4,12,6],[47,0,47,2],[47,3,47,7],[46,0,46,2],[46,3,46,7],[52,3,55,7],[53,0,53,1],[54,0,54,1],[49,0,49,2],[49,3,49,7],[51,3,51,7],[50,0,50,2],[50,3,50,7],[51,0,51,2]]}
["Australian 18 Footers League"]
["Starters and Judges Report"]
[]
["Name of Race:",null,{"$f":"Schedule!$D16","v":"NSW Championship – Race 5"},"Entrants:",{"$f":"Schedule!G16","v":17},"Date:",{"$f":"Schedule!B16","v":"2015-02-01"}]
[null,null,{"$f":"Schedule!$E16","v":"Club Championship – Race 9"}]
[null,null,{"$f":"Schedule!$F16","v":""}]
["Course:",null,null,"Wind:",null,"Tide:"]
["Race Start Time:",null,null,"Race Finish Time :",null,"15:52:53",null,null,null,null,null,null,"Ctrl+Shift+R to formulate H/cap result."]
[]
["Start Mode:",null,{"$f":"IF(Schedule!C16=\"3b\",\"SCRATCH/3Buoy\",\"SCRATCH\")","v":"SCRATCH"}]
[null,"Non Starters:",0,"Non Finishers:",0]
[]
["Race Officer:",null,null,null,null,null,null,null,null,null,null,null,"Entrants",null,null,"Result"]
["Finish Placings","Recall #","Boat Name","Finish Time","Elapsed Time","Handicap","Corrected Time",{"$f":"IF(C10=\"Scratch\",\"H/cap Position\",\"Scratch Position\")","v":"H/cap Position"},null,null,null,"Recall #","Boat Name","H/CAP",null,"Scratch","H/Cap"]
[1,null,{"$f":"IF(ISBLANK(B15),\"\",VLOOKUP(B15,L$15:M$45,2))","v":""},null,{"$f":"IF(ISBLANK(D15),\"\",D15-C$8)","v":""},{"$f":"IF(ISBLANK(B15),\"\",VLOOKUP(B15,L$15:N$45,3))","v":""},{"$f":"IF(ISBLANK(D15),\"\",IF(C$10=\"Scratch\",E15-TIME(,F15,),E15))","v":""},null,1,null,null,1,null,null,null,null,null,9]
[2,null,{"$f":"IF(ISBLANK(B16),\"\",VLOOKUP(B16,L$15:M$45,2))","v":""},null,"","","",null,2,null,null,2,null,null,null,null,null,10]
[3,null,{"$f":"IF(ISBLANK(B17),\"\",VLOOKUP(B17,L$15:M$45,2))","v":""},null,"","","",null,3,null,null,3,null,null,null,null,null,3]
[4,null,{"$f":"IF(ISBLANK(B18),\"\",VLOOKUP(B18,L$15:M$45,2))","v":""},null,"","","",null,4,null,null,4,null,null,null,null,null,11]
[5,null,{"$f":"IF(ISBLANK(B19),\"\",VLOOKUP(B19,L$15:M$45,2))","v":""},null,"","","",null,5,null,null,5,null,null,null,null,null,6]
[6,null,"APPLIANCESONLINE.COM.AU",null,"","","",null,6,null,null,6,null,null,null,null,null,2]
[7,null,{"$f":"IF(ISBLANK(B21),\"\",VLOOKUP(B21,L$15:M$45,2))","v":""},null,"","","",null,7,null,null,7,null,null,null,null,null,1]
[8,null,"",null,"","","",null,8,null,null,8,null,null,null,null,null,7]
[9,null,"",null,"","","",null,9,null,null,9,null,null,null,null,null,16]
[10,null,"",null,"","","",null,10,null,null,10,null,null,null,null,null,4]
[11,null,"",null,"","","",null,11,null,null,11,null,null,null,null,null,5]
[12,null,"",null,"","","",null,12,null,null,12,null,null,null,null,null,8]
[13,null,"",null,"","","",null,13,null,null,13,null,null,null,null,null,12]
[14,null,"",null,"","","",null,14,null,null,14,null,null,null,null,null,13]
[15,null,"",null,"","","",null,15,null,null,15,null,null,null,null,null,17]
[16,null,"",null,"","","",null,16,null,null,16,null,null,null,null,null,20]
[17,null,"",null,"","","",null,17,null,null,17,null,null,null,null,null,14]
[18,null,"",null,"","","",null,18,null,null,18,null,null,null,null,null,15]
[19,null,"",null,"","","",null,19,null,null,19,null,null,null,null,null,20]
[20,null,null,null,"","",null,null,20,null,null,20,null,null,null,null,null,20]
[21,null,{"$f":"IF(ISBLANK(B35),\"\",VLOOKUP(B35,L$15:M$45,2))","v":""},null,"","",{"$f":"IF(ISBLANK(D35),\"\",IF(C$10=\"Scratch\",E35-TIME(,F35,),E35))","v":""},null,21,null,null,21,null,null,null,null,null,20]
[22,null,"",null,"","","",null,22,null,null,22,null,null,null,null,null,20]
[23,null,"",null,"","","",null,23,null,null,23,null,null,null,null,null,20]
[24,null,"",null,"","","",null,24,null,null,24,null,null,null,null,null,20]
[25,null,"",null,"","","",null,25]
[26,null,"",null,"","","",null,26]
[27,null,"",null,"","","",null,27]
[28,null,"",null,"","","",null,28]
[29,null,"",null,"","","",null,29]
["Visitor",null,null,null,"",null,null,null,30]
["Visitor",null,null,null,null,null,null,null,31]
[]
["Non Starters","Non Starters",null,"Non Finishers","Non Finishers"]
[]
[]
[]
[]
[]
[null,null,"Comments:"]
["Sailing Time:",null,{"$f":"E15","v":""}]
["Fastest Time:",null,{"$f":"C15","v":""}]
["Margins:","1st - 2nd",{"$f":"D16-D15","v":"00:00:00"}]
[null,"2nd - 3rd",{"$f":"D17-D16","v":"00:00:00"}]

{"sheet":"8-02-15","index":14,"n_rows":57,"n_cols":18,"rows_kept":57,"cut":false,"hidden":false,"merged":[[9,0,9,1],[48,0,48,2],[48,3,48,7],[12,15,12,16],[12,0,12,1],[12,4,12,6],[47,0,47,2],[47,3,47,7],[46,3,46,7],[46,0,46,2],[0,0,0,7],[1,0,1,7],[3,0,3,1],[3,6,3,7],[7,0,7,1],[7,3,7,4],[7,5,7,7],[6,0,6,1],[52,3,55,7],[53,0,53,1],[54,0,54,1],[49,0,49,2],[49,3,49,7],[51,3,51,7],[50,0,50,2],[50,3,50,7],[51,0,51,2]]}
["Australian 18 Footers League"]
["Starters and Judges Report"]
[]
["Name of Race:",null,{"$f":"Schedule!#REF!","v":{"$error":"#REF!"}},"Entrants:",{"$f":"Schedule!G17","v":17},"Date:",{"$f":"Schedule!B17","v":"2015-02-08"}]
[null,null,{"$f":"Schedule!$E17","v":0}]
[null,null,{"$f":"Schedule!$D17","v":"President’s Trophy"}]
["Course:",null,null,"Wind:",null,"Tide:",null,null,null,null,null,null,"Ctrl+Shift+R to formulate H/cap result."]
["Race Start Time:",null,null,"Race Finish Time :",null,{"$f":"D15","v":"00:00:00"}]
[]
["Start Mode:",null,{"$f":"IF(Schedule!C17=\"3b\",\"SCRATCH/3Buoy\",\"SCRATCH\")","v":"SCRATCH/3Buoy"}]
[null,"Non Starters:",0,"Non Finishers:",0]
[]
["Race Officer:",null,null,null,null,null,null,null,null,null,null,null,"Entrants",null,null,"Result"]
["Finish Placings","Recall #","Boat Name","Finish Time","Elapsed Time","Handicap","Corrected Time",{"$f":"IF(C10=\"Scratch\",\"H/cap Position\",\"Scratch Position\")","v":"Scratch Position"},null,null,null,"Recall #","Boat Name","H/CAP",null,"Scratch","H/Cap"]
[1,null,{"$f":"IF(ISBLANK(B15),\"\",VLOOKUP(B15,L$15:M$45,2))","v":""},null,{"$f":"IF(ISBLANK(D15),\"\",D15-C$8)","v":""},{"$f":"IF(ISBLANK(B15),\"\",VLOOKUP(B15,L$15:N$45,3))","v":""},{"$f":"IF(ISBLANK(D15),\"\",IF(C$10=\"Scratch\",E15-TIME(,F15,),E15))","v":""},null,1,null,null,1,null,null,null,null,null,5]
[2,null,"",null,"","","",null,2,null,null,2,null,null,null,null,null,7]
[3,null,"",null,"","","",null,3,null,null,3,null,null,null,null,null,20]
[4,null,"",null,"","","",null,4,null,null,4,null,null,null,null,null,10]
[5,null,"",null,"","","",null,5,null,null,5,null,null,null,null,null,20]
[6,null,"",null,"","","",null,6,null,null,6,null,null,null,null,null,4]
[7,null,"",null,"","","",null,7,null,null,7,null,null,null,null,null,1]
[8,null,"",null,"","","",null,8,null,null,8,null,null,null,null,null,2]
[9,null,"",null,"","","",null,9,null,null,9,null,null,null,null,null,20]
[10,null,"",null,"","","",null,10,null,null,10,null,null,null,null,null,11]
[11,null,"",null,"","","",null,11,null,null,11,null,null,null,null,null,3]
[12,null,"",null,"","","",null,12,null,null,12,null,null,null,null,null,8]
[13,null,"",null,"","","",null,13,null,null,13,null,null,null,null,null,20]
[14,null,"",null,"","","",null,14,null,null,14,null,null,null,null,null,9]
[15,null,"",null,"","","",null,15,null,null,15,null,null,null,null,null,12]
[16,null,"",null,"","","",null,16,null,null,16,null,null,null,null,null,6]
[17,null,"",null,"","","",null,17,null,null,17,null,null,null,null,null,13]
[18,null,"",null,"","","",null,18,null,null,18,null,null,null,null,null,20]
[19,null,"",null,"","","",null,19,null,null,19,null,null,null,null,null,14]
[20,null,"",null,"","","",null,20,null,null,20,null,null,null,null,null,20]
[21,null,"",null,"","","",null,21,null,null,21,null,null,null,null,null,20]
[22,null,"",null,"","","",null,22,null,null,22,null,null,null,null,null,20]
[23,null,"",null,"","","",null,23,null,null,23,null,null,null,null,null,20]
[24,null,"",null,"","","",null,24,null,null,null,null,null,null,null,null,20]
[25,null,"",null,"","","",null,25]
[26,null,"",null,"","","",null,26]
[27,null,"",null,"","","",null,27]
[28,null,"",null,"","","",null,28]
[29,null,"",null,"","","",null,29]
["Visitor",null,null,null,"","","",null,30]
["Visitor",null,null,null,null,null,null,null,31]
[]
["Non Starters","Non Starters",null,"Non Finishers","Non Finishers"]
[]
[]
[]
[]
[]
[null,null,"Comments:"]
["Sailing Time:",null,{"$f":"E15","v":""}]
["Fastest Time:",null,{"$f":"C15","v":""}]
["Margins:","1st - 2nd",{"$f":"D16-D15","v":"00:00:00"}]
[null,"2nd - 3rd",{"$f":"D17-D16","v":"00:00:00"}]

{"sheet":"1-03-15","index":15,"n_rows":57,"n_cols":18,"rows_kept":57,"cut":false,"hidden":false,"merged":[[12,15,12,16],[52,3,55,7],[53,0,53,1],[54,0,54,1],[50,0,50,2],[50,3,50,7],[51,0,51,2],[51,3,51,7],[46,0,46,2],[46,3,46,7],[12,4,12,6],[12,0,12,1],[49,3,49,7],[47,3,47,7],[48,0,48,2],[47,0,47,2],[0,0,0,7],[1,0,1,7],[3,0,3,1],[3,6,3,7],[6,0,6,1],[48,3,48,7],[49,0,49,2],[9,0,9,1],[7,0,7,1],[7,3,7,4],[7,5,7,7]]}
["Australian 18 Footers League"]
["Starters and Judges Report"]
[]
["Name of Race:",null,{"$f":"Schedule!#REF!","v":{"$error":"#REF!"}},"Entrants:",{"$f":"Schedule!G18","v":17},"Date:",{"$f":"Schedule!B18","v":"2015-03-01"}]
[null,null,{"$f":"Schedule!E18","v":0}]
[null,null,{"$f":"Schedule!#REF!","v":{"$error":"#REF!"}}]
["Course:",null,null,"Wind:",null,"Tide:"]
["Race Start Time:",null,null,"Race Finish Time :",null,{"$f":"D15","v":"00:00:00"},null,null,null,null,null,null,"Ctrl+Shift+R to formulate H/cap result."]
[]
["Start Mode:",null,{"$f":"IF(Schedule!#REF!=\"3b\",\"SCRATCH/3Buoy\",\"SCRATCH\")","v":{"$error":"#REF!"}}]
[null,"Non Starters:",0,"Non Finishers:",0]
[]
["Race Officer:",null,null,null,null,null,null,null,null,null,null,null,"Entrants",null,null,"Result"]
["Finish Placings","Recall #","Boat Name","Finish Time","Elapsed Time","Handicap","Corrected Time",{"$f":"IF(C10=\"Scratch\",\"H/cap Position\",\"Scratch Position\")","v":{"$error":"#REF!"}},null,null,null,"Recall #","Boat Name","H/CAP",null,"Scratch","H/Cap"]
[1,null,{"$f":"IF(ISBLANK(B15),\"\",VLOOKUP(B15,L$15:M$45,2))","v":""},null,{"$f":"IF(ISBLANK(D15),\"\",D15-C$8)","v":""},{"$f":"IF(ISBLANK(B15),\"\",VLOOKUP(B15,L$15:N$45,3))","v":""},{"$f":"IF(ISBLANK(D15),\"\",IF(C$10=\"Scratch\",E15-TIME(,F15,),E15))","v":""},null,1,null,null,1,null,null,null,null,null,5]
[2,null,"",null,"","","",null,2,null,null,2,null,null,null,null,null,7]
[3,null,"",null,"","","",null,3,null,null,3,null,null,null,null,null,20]
[4,null,"",null,"","","",null,4,null,null,4,null,null,null,null,null,10]
[5,null,"",null,"","","",null,5,null,null,5,null,null,null,null,null,4]
[6,null,"",null,"","","",null,6,null,null,6,null,null,null,null,null,20]
[7,null,"",null,"","","",null,7,null,null,7,null,null,null,null,null,2]
[8,null,"",null,"","","",null,8,null,null,8,null,null,null,null,null,6]
[9,null,"",null,"","","",null,9,null,null,9,null,null,null,null,null,12]
[10,null,"",null,"","","",null,10,null,null,10,null,null,null,null,null,8]
[11,null,"",null,"","","",null,11,null,null,11,null,null,null,null,null,9]
[12,null,"",null,"","","",null,12,null,null,12,null,null,null,null,null,13]
[13,null,"",null,"","","",null,13,null,null,13,null,null,null,null,null,1]
[14,null,"",null,"","","",null,14,null,null,14,null,null,null,null,null,20]
[15,null,"",null,"","","",null,15,null,null,15,null,null,null,null,null,11]
[16,null,"",null,"","","",null,16,null,null,16,null,null,null,null,null,3]
[17,null,"",null,"","","",null,17,null,null,17,null,null,null,null,null,15]
[18,null,"",null,"","","",null,18,null,null,18,null,null,null,null,null,20]
[19,null,"",null,"","","",null,19,null,null,19,null,null,null,null,null,14]
[20,null,"",null,"","","",null,20,null,null,20,null,null,null,null,null,20]
[21,null,"",null,"","","",null,21,null,null,21,null,null,null,null,null,20]
[22,null,"CST",null,"","",null,null,22,null,null,22,null,null,null,null,null,20]
[23,null,"Eurolink",null,"","",null,null,23,null,null,23,null,null,null,null,null,20]
[24,null,{"$f":"IF(ISBLANK(B38),\"\",VLOOKUP(B38,L$15:M$45,2))","v":""},null,"","",{"$f":"IF(ISBLANK(D38),\"\",IF(C$10=\"Scratch\",E38-TIME(,F38,),E38))","v":""},null,24,null,null,24,null,null,null,null,null,20]
[25,null,"",null,"","","",null,25]
[26,null,"",null,"","","",null,26]
[27,null,"",null,"","","",null,27]
[28,null,"",null,"","","",null,28]
[29,null,"",null,"","","",null,29]
[30,null,"",null,"","","",null,30]
[31,null,null,null,null,null,null,null,31]
[]
["Non Starters","Non Starters",null,"Non Finishers","Non Finishers"]
[]
[]
[]
[]
[]
[null,null,"Comments:"]
["Sailing Time:",null,{"$f":"E15","v":""}]
["Fastest Time:",null,{"$f":"C15","v":""}]
["Margins:","1st - 2nd",{"$f":"D16-D15","v":"00:00:00"}]
[null,"2nd - 3rd",{"$f":"D17-D16","v":"00:00:00"}]

{"sheet":"8-03-15","index":16,"n_rows":57,"n_cols":18,"rows_kept":57,"cut":false,"hidden":false,"merged":[[9,0,9,1],[0,0,0,7],[1,0,1,7],[3,0,3,1],[3,6,3,7],[7,0,7,1],[7,3,7,4],[7,5,7,7],[6,0,6,1],[48,0,48,2],[48,3,48,7],[12,15,12,16],[12,0,12,1],[12,4,12,6],[47,0,47,2],[47,3,47,7],[46,0,46,2],[46,3,46,7],[52,3,55,7],[53,0,53,1],[54,0,54,1],[49,0,49,2],[49,3,49,7],[51,3,51,7],[50,0,50,2],[50,3,50,7],[51,0,51,2]]}
["Australian 18 Footers League"]
["Starters and Judges Report"]
[]
["Name of Race:",null,{"$f":"Schedule!$D19","v":"Club Championship – Race 10"},"Entrants:",{"$f":"Schedule!G19","v":17},"Date:",{"$f":"Schedule!B19","v":"2015-03-08"}]
[null,null,{"$f":"Schedule!#REF!","v":{"$error":"#REF!"}}]
[null,null,{"$f":"Schedule!$F18","v":""}]
["Course:",null,null,"Wind:",null,"Tide:"]
["Race Start Time:",null,null,"Race Finish Time :",null,{"$f":"D15","v":"00:00:00"},null,null,null,null,null,null,"Ctrl+Shift+R to formulate H/cap result."]
[]
["Start Mode:",null,{"$f":"IF(Schedule!C19=\"3b\",\"SCRATCH/3Buoy\",\"SCRATCH\")","v":"SCRATCH"}]
[null,"Non Starters:",0,"Non Finishers:",0]
[]
["Race Officer:",null,null,null,null,null,null,null,null,null,null,null,"Entrants",null,null,"Result"]
["Finish Placings","Recall #","Boat Name","Finish Time","Elapsed Time","Handicap","Corrected Time",{"$f":"IF(C10=\"Scratch\",\"H/cap Position\",\"Scratch Position\")","v":"H/cap Position"},null,null,null,"Recall #","Boat Name","H/CAP",null,"Scratch","H/Cap"]
[1,null,{"$f":"IF(ISBLANK(B15),\"\",VLOOKUP(B15,L$15:M$45,2))","v":""},null,{"$f":"IF(ISBLANK(D15),\"\",D15-C$8)","v":""},{"$f":"IF(ISBLANK(B15),\"\",VLOOKUP(B15,L$15:N$45,3))","v":""},{"$f":"IF(ISBLANK(D15),\"\",IF(C$10=\"Scratch\",E15-TIME(,F15,),E15))","v":""},null,1,null,null,1,null,null,null,null,null,2]
[2,null,"",null,"","","",null,2,null,null,2,null,null,null,null,null,14]
[3,null,"",null,"","","",null,3,null,null,3,null,null,null,null,null,11]
[4,null,"",null,"","","",null,4,null,null,4,null,null,null,null,null,12]
[5,null,"",null,"","","",null,5,null,null,5,null,null,null,null,null,8]
[6,null,"",null,"","","",null,6,null,null,6,null,null,null,null,null,1]
[7,null,"",null,"","","",null,7,null,null,7,null,null,null,null,null,7]
[8,null,"",null,"","","",null,8,null,null,8,null,null,null,null,null,3]
[9,null,"",null,"","","",null,9,null,null,9,null,null,null,null,null,20]
[10,null,"",null,"","","",null,10,null,null,10,null,null,null,null,null,6]
[11,null,"",null,"","","",null,11,null,null,11,null,null,null,null,null,4]
[12,null,"",null,"","","",null,12,null,null,12,null,null,null,null,null,5]
[13,null,"",null,"","","",null,13,null,null,13,null,null,null,null,null,20]
[14,null,"",null,"","","",null,14,null,null,14,null,null,null,null,null,20]
[15,null,"",null,"","","",null,15,null,null,15,null,null,null,null,null,9]
[16,null,"",null,"","","",null,16,null,null,16,null,null,null,null,null,20]
[17,null,"",null,"","","",null,17,null,null,17,null,null,null,null,null,10]
[18,null,"",null,"","","",null,18,null,null,18,null,null,null,null,null,20]
[19,null,"",null,"","","",null,19,null,null,19,null,null,null,null,null,13]
[20,null,"",null,"","","",null,20,null,null,20,null,null,null,null,null,20]
[21,null,"",null,"","","",null,21,null,null,21,null,null,null,null,null,20]
[22,null,"",null,"","","",null,22,null,null,22,null,null,null,null,null,20]
[23,null,"",null,"","","",null,23,null,null,23,null,null,null,null,null,20]
[24,null,"",null,"","","",null,24,null,null,null,null,null,null,null,null,20]
[25,null,"",null,"","","",null,25]
[26,null,"",null,"","","",null,26]
[27,null,"",null,"","","",null,27]
[28,null,"",null,"","","",null,28]
[29,null,"",null,"","","",null,29]
[30,null,"",null,"","","",null,30]
[31,null,null,null,null,null,null,null,31]
[]
["Non Starters","Non Starters",null,"Non Finishers","Non Finishers"]
[]
[]
[]
[]
[]
[null,null,"Comments:"]
["Sailing Time:",null,{"$f":"E15","v":""}]
["Fastest Time:",null,{"$f":"C15","v":""}]
["Margins:","1st - 2nd",{"$f":"D16-D15","v":"00:00:00"}]
[null,"2nd - 3rd",{"$f":"D17-D16","v":"00:00:00"}]

{"sheet":"15-03-15","index":17,"n_rows":57,"n_cols":18,"rows_kept":57,"cut":false,"hidden":false,"merged":[[12,15,12,16],[52,3,55,7],[53,0,53,1],[54,0,54,1],[50,0,50,2],[50,3,50,7],[51,0,51,2],[51,3,51,7],[46,0,46,2],[46,3,46,7],[12,4,12,6],[12,0,12,1],[49,3,49,7],[47,3,47,7],[48,0,48,2],[47,0,47,2],[0,0,0,7],[1,0,1,7],[3,0,3,1],[3,6,3,7],[6,0,6,1],[48,3,48,7],[49,0,49,2],[9,0,9,1],[7,0,7,1],[7,3,7,4],[7,5,7,7]]}
["Australian 18 Footers League"]
["Starters and Judges Report"]
[]
["Name of Race:",null,{"$f":"Schedule!$D18","v":"Queen of the Harbour"},"Entrants:",{"$f":"Schedule!G20","v":17},"Date:",{"$f":"Schedule!B20","v":"2015-03-15"}]
[null,null,{"$f":"Schedule!#REF!","v":{"$error":"#REF!"}}]
[]
["Course:",null,null,"Wind:",null,"Tide:"]
["Race Start Time:",null,null,"Race Finish Time :",null,{"$f":"D15","v":"00:00:00"},null,null,null,null,null,null,"Ctrl+Shift+R to formulate H/cap result."]
[]
["Start Mode:",null,{"$f":"IF(Schedule!C18=\"3b\",\"SCRATCH/3Buoy\",\"SCRATCH\")","v":"SCRATCH/3Buoy"}]
[null,"Non Starters:",0,"Non Finishers:",0]
[]
["Race Officer:",null,null,null,null,null,null,null,null,null,null,null,"Entrants",null,null,"Result"]
["Finish Placings","Recall #","Boat Name","Finish Time","Elapsed Time","Handicap","Corrected Time",{"$f":"IF(C10=\"Scratch\",\"H/cap Position\",\"Scratch Position\")","v":"Scratch Position"},null,null,null,"Recall #","Boat Name","H/CAP",null,"Scratch","H/Cap"]
[1,null,{"$f":"IF(ISBLANK(B15),\"\",VLOOKUP(B15,L$15:M$45,2))","v":""},null,{"$f":"IF(ISBLANK(D15),\"\",D15-C$8)","v":""},{"$f":"IF(ISBLANK(B15),\"\",VLOOKUP(B15,L$15:N$45,3))","v":""},{"$f":"IF(ISBLANK(D15),\"\",IF(C$10=\"Scratch\",E15-TIME(,F15,),E15))","v":""},null,1,null,null,1,null,null,null,null,null,4]
[2,null,"",null,"","","",null,2,null,null,2,null,null,null,null,null,1]
[3,null,"",null,"","","",null,3,null,null,3,null,null,null,null,null,2]
[4,null,"",null,"","","",null,4,null,null,4,null,null,null,null,null,6]
[5,null,"",null,"","","",null,5,null,null,5,null,null,null,null,null,8]
[6,null,"",null,"","","",null,6,null,null,6,null,null,null,null,null,7]
[7,null,"",null,"","","",null,7,null,null,7,null,null,null,null,null,12]
[8,null,"",null,"","","",null,8,null,null,8,null,null,null,null,null,5]
[9,null,"",null,"","","",null,9,null,null,9,null,null,null,null,null,9]
[10,null,"",null,"","","",null,10,null,null,10,null,null,null,null,null,3]
[11,null,"",null,"","","",null,11,null,null,11,null,null,null,null,null,15]
[12,null,"",null,"","","",null,12,null,null,12,null,null,null,null,null,20]
[13,null,"",null,"","","",null,13,null,null,13,null,null,null,null,null,10]
[14,null,"",null,"","","",null,14,null,null,14,null,null,null,null,null,16]
[15,null,"",null,"","","",null,15,null,null,15,null,null,null,null,null,11]
[16,null,"",null,"","","",null,16,null,null,16,null,null,null,null,null,20]
[17,null,"",null,"","","",null,17,null,null,17,null,null,null,null,null,13]
[18,null,"",null,"","","",null,18,null,null,18,null,null,null,null,null,14]
[19,null,"",null,"","","",null,19,null,null,19,null,null,null,null,null,17]
[20,null,"",null,"","","",null,20,null,null,20,null,null,null,null,null,20]
[21,null,"",null,"","","",null,21,null,null,21,null,null,null,null,null,20]
[22,null,"",null,"","","",null,22,null,null,22,null,null,null,null,null,20]
[23,null,"",null,"","","",null,23,null,null,23,null,null,null,null,null,20]
[24,null,"",null,"","","",null,24,null,null,null,null,null,null,null,null,20]
[25,null,"",null,"","","",null,25]
[26,null,"",null,"","","",null,26]
[27,null,"",null,"","","",null,27]
[28,null,"",null,"","","",null,28]
[29,null,"",null,"","","",null,29]
["Visitor",null,"CST",null,"","","",null,30]
[31,null,null,null,null,null,null,null,31]
[]
["Non Starters","Non Starters",null,"Non Finishers","Non Finishers"]
[]
[]
[]
[]
[]
[null,null,"Comments:"]
["Sailing Time:",null,{"$f":"E15","v":""}]
["Fastest Time:",null,{"$f":"C15","v":""}]
["Margins:","1st - 2nd",{"$f":"D16-D15","v":"00:00:00"}]
[null,"2nd - 3rd",{"$f":"D17-D16","v":"00:00:00"}]

{"sheet":"22-03-15","index":18,"n_rows":57,"n_cols":18,"rows_kept":57,"cut":false,"hidden":false,"merged":[[9,0,9,1],[0,0,0,7],[1,0,1,7],[3,0,3,1],[3,6,3,7],[7,0,7,1],[7,3,7,4],[7,5,7,7],[6,0,6,1],[48,0,48,2],[48,3,48,7],[12,15,12,16],[12,0,12,1],[12,4,12,6],[47,0,47,2],[47,3,47,7],[46,0,46,2],[46,3,46,7],[52,3,55,7],[53,0,53,1],[54,0,54,1],[49,0,49,2],[49,3,49,7],[51,3,51,7],[50,0,50,2],[50,3,50,7],[51,0,51,2]]}
["Australian 18 Footers League"]
["Starters and Judges Report"]
[]
["Name of Race:",null,{"$f":"Schedule!$D20","v":"Club Championship – Race 11"},"Entrants:",{"$f":"Schedule!G21","v":17},"Date:",{"$f":"Schedule!B21","v":"2015-03-22"}]
[null,null,{"$f":"Schedule!$E20","v":"Alice Burton Memorial Trophy"}]
[null,null,{"$f":"Schedule!$F21","v":""}]
["Course:",null,null,"Wind:",null,"Tide:"]
["Race Start Time:",null,null,"Race Finish Time :",null,{"$f":"D15","v":"00:00:00"},null,null,null,null,null,null,"Ctrl+Shift+R to formulate H/cap result."]
[]
["Start Mode:",null,{"$f":"IF(Schedule!C21=\"3b\",\"SCRATCH/3Buoy\",\"SCRATCH\")","v":"SCRATCH"}]
[null,"Non Starters:",0,"Non Finishers:",0]
[]
["Race Officer:",null,null,null,null,null,null,null,null,null,null,null,"Entrants",null,null,"Result"]
["Finish Placings","Recall #","Boat Name","Finish Time","Elapsed Time","Handicap","Corrected Time",{"$f":"IF(C10=\"Scratch\",\"H/cap Position\",\"Scratch Position\")","v":"H/cap Position"},null,null,null,"Recall #","Boat Name","H/CAP",null,"Scratch","H/Cap"]
[1,null,{"$f":"IF(ISBLANK(B15),\"\",VLOOKUP(B15,L$15:M$45,2))","v":""},null,{"$f":"IF(ISBLANK(D15),\"\",D15-C$8)","v":""},{"$f":"IF(ISBLANK(B15),\"\",VLOOKUP(B15,L$15:N$45,3))","v":""},{"$f":"IF(ISBLANK(D15),\"\",IF(C$10=\"Scratch\",E15-TIME(,F15,),E15))","v":""},null,1,null,null,1,null,null,null,null,null,1]
[2,null,"",null,"","","",null,2,null,null,2,null,null,null,null,null,5]
[3,null,"",null,"","","",null,3,null,null,3,null,null,null,null,null,8]
[4,null,"",null,"","","",null,4,null,null,4,null,null,null,null,null,20]
[5,null,"",null,"","","",null,5,null,null,5,null,null,null,null,null,4]
[6,null,"",null,"","","",null,6,null,null,6,null,null,null,null,null,2]
[7,null,"",null,"","","",null,7,null,null,7,null,null,null,null,null,11]
[8,null,"",null,"","","",null,8,null,null,8,null,null,null,null,null,6]
[9,null,"",null,"","","",null,9,null,null,9,null,null,null,null,null,20]
[10,null,"",null,"","","",null,10,null,null,10,null,null,null,null,null,7]
[11,null,"",null,"","","",null,11,null,null,11,null,null,null,null,null,3]
[12,null,"",null,"","","",null,12,null,null,12,null,null,null,null,null,10]
[13,null,"",null,"","","",null,13,null,null,13,null,null,null,null,null,9]
[14,null,"",null,"","","",null,14,null,null,14,null,null,null,null,null,15]
[15,null,"",null,"","","",null,15,null,null,15,null,null,null,null,null,13]
[16,null,"",null,"","","",null,16,null,null,16,null,null,null,null,null,20]
[17,null,"",null,"","","",null,17,null,null,17,null,null,null,null,null,14]
[18,null,"",null,"","","",null,18,null,null,18,null,null,null,null,null,12]
[19,null,"",null,"","","",null,19,null,null,19,null,null,null,null,null,16]
[20,null,"",null,"","","",null,20,null,null,20,null,null,null,null,null,20]
[21,null,"",null,"","","",null,21,null,null,21,null,null,null,null,null,20]
[22,null,"",null,"","","",null,22,null,null,22,null,null,null,null,null,20]
[23,null,"",null,"","","",null,23,null,null,23,null,null,null,null,null,20]
[24,null,"",null,"","","",null,24,null,null,null,null,null,null,null,null,20]
[25,null,"",null,"","","",null,25]
[26,null,"",null,"","","",null,26]
[27,null,"",null,"","","",null,27]
[28,null,"",null,"","","",null,28]
[29,null,"",null,"","","",null,29]
[30,null,"",null,"","","",null,30]
[31,null,null,null,null,null,null,null,31]
[]
["Non Starters","Non Starters",null,"Non Finishers","Non Finishers"]
[]
[]
[]
[]
[]
[null,null,"Comments:"]
["Sailing Time:",null,{"$f":"E15","v":""}]
["Fastest Time:",null,{"$f":"C15","v":""}]
["Margins:","1st - 2nd",{"$f":"D16-D15","v":"00:00:00"}]
[null,"2nd - 3rd",{"$f":"D17-D16","v":"00:00:00"}]

{"sheet":"12-10-14","index":19,"n_rows":57,"n_cols":18,"rows_kept":57,"cut":false,"hidden":false,"merged":[[12,15,12,16],[12,0,12,1],[12,4,12,6],[51,3,51,7],[49,0,49,2],[50,0,50,2],[51,0,51,2],[47,3,47,7],[50,3,50,7],[9,0,9,1],[46,3,46,7],[48,3,48,7],[49,3,49,7],[46,0,46,2],[52,3,55,7],[53,0,53,1],[54,0,54,1],[47,0,47,2],[48,0,48,2],[0,0,0,7],[1,0,1,7],[3,0,3,1],[3,6,3,7],[7,0,7,1],[7,3,7,4],[7,5,7,7],[6,0,6,1]]}
["Australian 18 Footers League"]
["Starters and Judges Report"]
[]
["Name of Race:",null,{"$f":"Schedule!$D2","v":"R. Watt Memorial Trophy"},"Entrants:",{"$f":"Schedule!G2","v":17},"Date:",{"$f":"Schedule!B2","v":"2014-10-12"}]
[null,null,{"$f":"Schedule!$E2","v":"  "}]
[null,null,{"$f":"Schedule!$F2","v":""},null,null,null,null,null,null,null,null,null,"Ctrl+Shift+R to formulate H/cap result."]
["Course:",null,"1-North East","Wind:","NE","Tide:","EBBING",null,null,null,null,null,"Ctrl+Shift+T to enter Finish Times"]
["Race Start Time:",null,"14:40:00","Race Finish Time :",null,{"$f":"D15","v":"16:14:08"}]
[]
["Start/Race Mode:",null,{"$f":"IF(Schedule!C2=\"3b\",\"SCRATCH/3 BUOY\",\"SCRATCH\")","v":"SCRATCH/3 BUOY"}]
[null,"Non Starters:",0,"Non Finishers:",0]
[]
["Starter:",null,"Doug Cameron","Judge:",null,null,null,null,null,null,null,null,"Entrants",null,null,"Result"]
["Finish Placings","Recall #","Boat Name","Finish Time","Elapsed Time","Handicap","Corrected Time",{"$f":"IF(C10=\"Scratch\",\"H/cap Position\",\"Scratch Position\")","v":"Scratch Position"},null,null,null,"Recall #","Boat Name","H/CAP",null,"Scratch","H/Cap"]
[1,1,{"$f":"IF(ISBLANK(B15),\"\",VLOOKUP(B15,L$15:M$45,2))","v":"THURLOW FISHER LAWYERS"},"16:14:08",{"$f":"IF(ISBLANK(D15),\"\",D15-C$8)","v":"01:34:08"},{"$f":"IF(ISBLANK(B15),\"\",VLOOKUP(B15,L$15:N$45,3))","v":1},{"$f":"IF(ISBLANK(D15),\"\",IF(C$10=\"Scratch\",E15-TIME(,F15,),E15))","v":"01:34:08"},1,1,null,null,1,"THURLOW FISHER LAWYERS",1,null,1,1,1]
[2,3,"ASKO GORENJE","16:14:20","01:34:20",2,"01:34:20",2,2,null,null,2,"YANDOO",4,null,8,8,8]
[3,7,"GOTTA LOVE IT 7","16:15:14","01:35:14",0,"01:35:14",3,3,null,null,3,"ASKO GORENJE",2,null,2,2,2]
[4,12,"LUMIX","16:15:37","01:35:37",5,"01:35:37",4,4,null,null,4,"DE’LONGHI",9,null,18,18,18]
[5,8,"SMEG","16:15:40","01:35:40",3,"01:35:40",5,5,null,null,5,"APPLIANCESONLINE.COM.AU",2,null,6,6,6]
[6,5,"APPLIANCESONLINE.COM.AU","16:15:56","01:35:56",2,"01:35:56",6,6,null,null,6,"COOPERS 62-RAG & FAMISH HOTEL",1,null,7,7,7]
[7,6,"COOPERS 62-RAG & FAMISH HOTEL","16:16:00","01:36:00",1,"01:36:00",7,7,null,null,7,"GOTTA LOVE IT 7",0,null,3,3,3]
[8,2,"YANDOO","16:16:15","01:36:15",4,"01:36:15",8,8,null,null,8,"SMEG",3,null,5,5,5]
[9,11,"MOJO WINE","16:16:44","01:36:44",2,"01:36:44",9,9,null,null,9,"PURE BLONDE",10,null,18,18,18]
[10,13,"COMPASSMARKETS.COM","16:27:14","01:47:14",7,"01:47:14",10,10,null,null,10,"FISHER & PAYKEL",10,null,12,12,12]
[11,15,"NOAKES SAILING","16:32:54","01:52:54",5,"01:52:54",11,11,null,null,11,"MOJO WINE",2,null,9,9,9]
[12,10,"FISHER & PAYKEL","16:37:19","01:57:19",10,"01:57:19",12,12,null,null,12,"LUMIX",5,null,4,4,4]
[13,17,"ILVE","16:41:47","02:01:47",10,"02:01:47",13,13,null,null,13,"COMPASSMARKETS.COM",7,null,10,10,10]
[14,null,"",null,"","","",14,14,null,null,14,"THE KITCHEN MAKER",5,null,18,18,18]
[15,null,"",null,"","","",15,15,null,null,15,"NOAKES SAILING",5,null,11,11,11]
[16,null,"",null,"","","",16,16,null,null,16,"HAIER APPLIANCES",10,null,18,18,18]
[17,null,"",null,"","","",17,17,null,null,17,"ILVE",10,null,13,13,13]
[18,null,"",null,"","","",18,18,null,null,18,null,null,null,18,18,18]
[19,null,"",null,"","","",19,19,null,null,19,null,null,null,18,18,18]
[20,null,"",null,"","","",20,20,null,null,20,null,null,null,18,18,18]
[21,null,"",null,"","","",21,21,null,null,21,null,null,null,18,18,18]
[22,null,"",null,"","","",22,22,null,null,22,null,null,null,18,18,18]
[23,null,"",null,"","","",23,23,null,null,23,null,null,null,18,18,18]
[24,null,"",null,"",null,"",24,24,null,null,null,null,null,null,18,18,18]
[25,null,"",null,"",{"$f":"IF(ISBLANK(B39),\"\",VLOOKUP(B39,L$15:N$45,3))","v":""},"",25,25,null,null,null,null,null,null,18,18]
[26,null,"",null,"","","",26,26,null,null,null,null,null,null,18,18]
[27,null,"",null,"","","",27,27,null,null,null,null,null,null,18,18]
[28,null,"",null,"","","",28,28,null,null,null,null,null,null,18,18]
[29,null,"",null,"","","",29,29,null,null,null,null,null,null,18,18]
[30,null,"",null,"","","",30,30,null,null,null,null,null,null,18,18]
[31,null,null,null,null,null,null,31,31,null,null,null,null,null,null,18,18]
[]
["Non Starters","Non Starters",null,"Non Finishers","Non Finishers"]
["Lumix",null,null,"DE'LONGHI"]
[null,null,null,"PURE BLONDE"]
[null,null,null,"THE KITCHEN MAKER"]
[]
[]
[null,null,"Comments:"]
["Sailing Time:",null,{"$f":"E15","v":"01:34:08"}]
["Fastest Time:",null,{"$f":"C15","v":"THURLOW FISHER LAWYERS"}]
["Margins:","1st - 2nd",{"$f":"D16-D15","v":"00:00:12"}]
[null,"2nd - 3rd",{"$f":"D17-D16","v":"00:00:54"}]

{"sheet":"19-10-14","index":20,"n_rows":57,"n_cols":18,"rows_kept":57,"cut":false,"hidden":false,"merged":[[0,0,0,7],[1,0,1,7],[3,0,3,1],[3,6,3,7],[7,0,7,1],[7,3,7,4],[7,5,7,7],[6,0,6,1],[9,0,9,1],[52,3,55,7],[53,0,53,1],[54,0,54,1],[49,0,49,2],[49,3,49,7],[50,0,50,2],[51,0,51,2],[51,3,51,7],[47,0,47,2],[12,15,12,16],[50,3,50,7],[48,0,48,2],[46,0,46,2],[46,3,46,7],[47,3,47,7],[48,3,48,7],[12,0,12,1]]}
["Australian 18 Footers League"]
["Starters and Judges Report"]
[]
["Name of Race:",null,{"$f":"Schedule!D3","v":"Major A. Frizelle Trophy"},"Entrants:",{"$f":"Schedule!G3","v":17},"Date:",{"$f":"Schedule!B3","v":"2014-10-19"}]
[null,null,{"$f":"Schedule!$E3","v":"    "}]
[null,null,{"$f":"Schedule!$F3","v":""},null,null,null,null,null,null,null,null,null,"Ctrl+Shift+R to formulate H/cap result."]
["Course:",null,"Course 1 - NE","Wind:","NE 15-18","Tide:","Flood",null,null,null,null,null,"Ctrl+Shift+T to enter Finish Times"]
["Race Start Time:",null,"14:50:00","Race Finish Time :",null,"16:01:49"]
[]
["Start/Race Mode:",null,{"$f":"IF(Schedule!C3=\"3b\",\"SCRATCH/3 BUOY\",\"SCRATCH\")","v":"SCRATCH/3 BUOY"}]
[null,"Non Starters:",1,"Non Finishers:",4]
[]
["Race Officer:",null,null,null,null,null,null,null,null,null,null,null,"Entrants",null,null,"Result"]
["Finish Placings","Recall #","Boat Name","Finish Time","Elapsed Time","Handicap","Corrected Time",{"$f":"IF(C10=\"Scratch\",\"H/cap Position\",\"Scratch Position\")","v":"Scratch Position"},null,null,null,"Recall #","Boat Name","H/CAP",null,"Scratch","H/Cap"]
[1,7,{"$f":"IF(ISBLANK(B15),\"\",VLOOKUP(B15,L$15:M$45,2))","v":"GOTTA LOVE IT 7"},"16:01:49",{"$f":"IF(ISBLANK(D15),\"\",D15-C$8)","v":"01:11:49"},{"$f":"IF(ISBLANK(B15),\"\",VLOOKUP(B15,L$15:N$45,3))","v":1},{"$f":"IF(ISBLANK(D15),\"\",IF(C$10=\"Scratch\",E15-TIME(,F15,),E15))","v":"01:11:49"},1,1,null,null,1,"THURLOW FISHER LAWYERS",0,null,2,2,2]
[2,1,"THURLOW FISHER LAWYERS","16:04:53","01:14:53",0,"01:14:53",2,2,null,null,2,"YANDOO",6,null,4,4,4]
[3,6,"COOPERS 62-RAG & FAMISH HOTEL","16:05:14","01:15:14",3,"01:15:14",3,3,null,null,3,"ASKO GORENJE",2,null,7,7,7]
[4,2,"YANDOO","16:05:54","01:15:54",6,"01:15:54",4,4,null,null,4,"DE’LONGHI",10,null,10,10,10]
[5,11,"MOJO WINE","16:06:06","01:16:06",4,"01:16:06",5,5,null,null,5,"APPLIANCESONLINE.COM.AU",4,null,6,6,6]
[6,5,"APPLIANCESONLINE.COM.AU","16:06:34","01:16:34",4,"01:16:34",6,6,null,null,6,"COOPERS 62-RAG & FAMISH HOTEL",3,null,3,3,3]
[7,3,"ASKO GORENJE","16:08:43","01:18:43",2,"01:18:43",7,7,null,null,7,"GOTTA LOVE IT 7",1,null,1,1,1]
[8,13,"COMPASSMARKETS.COM","16:10:15","01:20:15",9,"01:20:15",8,8,null,null,8,"SMEG",5,null,9,9,9]
[9,8,"SMEG","16:13:58","01:23:58",5,"01:23:58",9,9,null,null,9,"PURE BLONDE",10,null,18,18,18]
[10,4,"DE’LONGHI","16:14:45","01:24:45",10,"01:24:45",10,10,null,null,10,"FISHER & PAYKEL",10,null,12,12,12]
[11,16,"HAIER APPLIANCES","16:15:51","01:25:51",10,"01:25:51",11,11,null,null,11,"MOJO WINE",4,null,5,5,5]
[12,10,"FISHER & PAYKEL","16:16:14","01:26:14",10,"01:26:14",12,12,null,null,12,"LUMIX",7,null,18,18,18]
[13,null,"",null,"","","",13,13,null,null,13,"COMPASSMARKETS.COM",9,null,8,8,8]
[14,null,"",null,"","","",14,14,null,null,14,"THE KITCHEN MAKER",7,null,18,18,18]
[15,null,"",null,"","","",15,15,null,null,15,"NOAKES SAILING",7,null,18,18,18]
[16,null,"",null,"","","",16,16,null,null,16,"HAIER APPLIANCES",10,null,11,11,11]
[17,null,"",null,"","","",17,17,null,null,17,"ILVE",10,null,18,18,18]
[18,null,"",null,"","","",18,18,null,null,18,null,null,null,18,18,18]
[19,null,"",null,"","","",19,19,null,null,19,null,null,null,18,18,18]
[20,null,"",null,"","","",20,20,null,null,20,null,null,null,18,18,18]
[21,null,"",null,"","","",21,21,null,null,21,null,null,null,18,18,18]
[22,null,"",null,"","","",22,22,null,null,22,null,null,null,18,18,18]
[23,null,"",null,"","","",23,23,null,null,23,null,null,null,18,18,18]
[24,null,"",null,"","","",24,24,null,null,null,null,null,null,18,18,18]
[25,null,"",null,"","","",25,25,null,null,null,null,null,null,18,18]
[26,null,"",null,"","","",26,26,null,null,null,null,null,null,18,18]
[27,null,"",null,"","","",27,27,null,null,null,null,null,null,18,18]
[28,null,"",null,"","","",28,28,null,null,null,null,null,null,18,18]
[29,null,"",null,"","","",29,29,null,null,null,null,null,null,18,18]
[30,null,"",null,"","","",30,30,null,null,null,null,null,null,18,18]
[31,null,null,null,null,null,null,31,31,null,null,null,null,null,null,18,18]
[]
["Non Starters","Non Starters",null,"Non Finishers","Non Finishers"]
["Pure Blonde",null,null,"Ilve"]
[null,null,null,"Lumix"]
[null,null,null,"Noakesailing"]
[null,null,null,"The Kitchen Maker"]
[]
[null,null,"Comments:","We will be starting at 14:30 in accordance with the Sailing Instructions next week. Please launch in time to make the start."]
["Sailing Time:",null,{"$f":"E15","v":"01:11:49"}]
["Fastest Time:",null,{"$f":"C15","v":"GOTTA LOVE IT 7"}]
["Margins:","1st - 2nd",{"$f":"D16-D15","v":"00:03:04"}]
[null,"2nd - 3rd",{"$f":"D17-D16","v":"00:00:21"}]

{"sheet":"BLANK","index":21,"n_rows":35,"n_cols":9,"rows_kept":35,"cut":false,"hidden":false,"merged":[]}
["Race Name:",null,null,null,null,"Min","Signal","Flag","Sound"]
["Date :","Course :",null,null,null,6,"Delay","AP - Up or Down ",2]
[null,null,null,null,"14:25:00",5,"Warning","Class Flag - UP",1]
["FINISH","ENTRANT","FINISH TIME",null,"14:26:00",4,"Preparatory","\"P\" - UP",1]
[1,null,"      :        :   ",null,"14:27:00",3]
[2,null,"      :        :   ",null,"14:28:00",2]
[3,null,"      :        :   ",null,"14:29:00",1,"One Minute","\"P\" - Down","1 long"]
[4,null,"      :        :   ",null,"14:30:00",0,"Start","Class Flag - Down",1]
[5,null,"      :        :   ",null,null,null,"IND Recall","Flag X",1]
[6,null,"      :        :   ",null,null,null,"GEN Recall","1st Sub",2]
[7,null,"      :        :   ",null,"14:34:00","-4","IND Recall","Flag X - Down"]
[8,null,"      :        :   "]
[9,null,"      :        :   "]
[10,null,"      :        :   "]
[11,null,"      :        :   "]
[12,null,"      :        :   "]
[13,null,"      :        :   "]
[14,null,"      :        :   "]
[15,null,"      :        :   "]
[16,null,"      :        :   "]
[17,null,"      :        :   "]
[null,null,"      :        :   "]
[null,null,"      :        :   "]
[null,null,"      :        :   "]
[null,null,"      :        :   "]
[null,null,"      :        :   "]
[null,null,"      :        :   "]
[null,null,"      :        :   "]
[null,null,"      :        :   "]
[null,null,"      :        :   "]
[null,null,"      :        :   "]
[null,null,"      :        :   "]
[null,null,"      :        :   "]
[null,null,"      :        :   "]
[31,null,"      :        :   "]

{"sheet":"Contacts","index":22,"n_rows":15,"n_cols":3,"rows_kept":15,"cut":false,"hidden":false,"merged":[]}
["18's Contacts"]
[]
["Race Team","Mobile","Email"]
["Garry Linacre","0418 224 138","garry@navionics.com.au"]
["Kelvin \"ACE\" Mowtell","0419 273 000","acemarine@bigpond.com.au"]
["Stephen McBurnie","0417 253 371","stephen@aswood-it.com"]
["Pam Scrivenor","0428 402 240","pjscriv@bigpond.com"]
["Lori Wilson","0414 898 927","lori.wilson@gmail.com"]
["Trish Hancock","0406 429 474","trishhancock@bigpond.com"]
[]
[]
[]
[]
["Club"]
["Frank Quealey","0417 421 952"," frank@18footers.com.au"]

{"sheet":"Starters","index":23,"n_rows":25,"n_cols":13,"rows_kept":25,"cut":false,"hidden":false,"merged":[]}
["Race Name:",null,null,"Buoys"]
["Date :","Course :",null,"A",null,"STARTS",null,null,1,2,3,4,5]
[null,null,null,null,null,"AP ▲",null,null,":",":",":",":",":"]
["Recall","Boat Name",null,"A",null,"AP/Recall ▼",null,null,":",":",":",":",":"]
[5,"APPLIANCESONLINE.COM.AU",null,"B",null,"Warning/Class ▲",null,null,":",":",":",":",":"]
[3,"ASKO GORENJE",null,"A",null,"Preparatory ▲",null,null,":",":",":",":",":"]
[13,"COMPASSMARKETS.COM",null,"A",null,"Prep▼ Long Sound",null,null,":",":",":",":",":"]
[6,"COOPERS 62-RAG & FAMISH HOTEL",null,"B",null,"Start/Class ▼",null,null,":",":",":",":",":"]
[4,"DE’LONGHI",null,"A"]
[10,"FISHER & PAYKEL",null,"B",null,"Indiv/Gen (I/G)"]
[7,"GOTTA LOVE IT 7",null,"C",null,null,null,null,null,null,"Recall Numbers"]
[16,"HAIER APPLIANCES",null,"B"]
[17,"ILVE",null,"C"]
[12,"LUMIX",null,"C"]
[11,"MOJO WINE",null,"A"]
[15,"NOAKES",null,"B"]
[9,"PURE BLONDE",null,"C"]
[8,"SMEG",null,"B"]
[14,"THE KITCHEN MAKER",null,"C"]
[1,"THURLOW FISHER LAWYERS",null,"C"]
[2,"YANDOO",null,"C"]
[null,null,null,"C"]
[null,null,null,"B"]
[null,null,null,"C"]
[null,null,null,"B"]

{"sheet":"Entrants","index":24,"n_rows":18,"n_cols":28,"rows_kept":18,"cut":false,"hidden":false,"merged":[]}
["Recall","Boat Name","H/CAP","Buoys"]
[1,"THURLOW FISHER LAWYERS",0,"A","1   THURLOW FISHER LAWYERS",null,"MICHAEL COXON",null,null,"SCRATCH",null,null,null,null,null,{"$f":"C2+Q2","v":1},1,null,"THURLOW FISHER LAWYERS",null,null,null,null,"MICHAEL COXON"]
[2,"YANDOO",8,"A","2   YANDOO",null,null,null,null,"JOHN WINNING",null,null,"8 MINS.",null,null,{"$f":"C3+Q3","v":9},1,null,"YANDOO",null,null,null,null,null,null,null,"JOHN WINNING"]
[3,"ASKO GORENJE",4,"B","3   ASKO APPLIANCES",null,null,null,"MARCUS ASHLEY-JONES",null,"4 MINS.",null,null,null,null,5,1,null,"ASKO APPLIANCES",null,null,null,null,null,null,"MARCUS ASHLEY-JONES"]
[4,"DE’LONGHI",10,"A","4   DE’LONGHI",null,null,null,null,"SIMON NEARN",null,null,"10 MINS.",null,null,11,1,null,"DE’LONGHI-RABBITOHS",null,null,null,null,null,"SIMON NEARN"]
[5,"APPLIANCESONLINE.COM.AU",6,"A","5   APPLIANCESONLINE.COM.AU",null,"MICAH LANE",null,null,null,"6 MINS.",null,null,null,null,7,1,null,"APPLIANCESONLINE.COM.AU",null,null,null,null,"MICAH LANE"]
[6,"COOPERS 62-RAG & FAMISH HOTEL",4,"B","6   COOPERS 62-RAG & FAMISH HOTEL","JACK MACARTNEY",null,null,"4 MINS.",null,null,null,null,null,null,5,1,null,"RAG & FAMISH HOTEL",null,null,null,null,null,"JACK MACARTNEY"]
[7,"GOTTA LOVE IT 7",0,"A","7   GOTTA LOVE IT 7",null,null,null,"SEVE JARVIN",null,null,null,"SCRATCH",null,null,1,1,null,"GOTTA LOVE IT 7",null,null,null,null,null,null,"SEVE JARVIN"]
[8,"SMEG",7,"B","8   SMEG",null,null,null,null,"DAVID WITT",null,null,null,"7 MINS.",null,6,-1,null,"SMEG",null,null,null,null,null,null,null,null,"NICK PRESS"]
[9,"PURE BLONDE",10,"C","9   PURE BLONDE",null,null,null,"NICK DALY",null,null,null,"10 MINS.",null,null,10,0,null,"PURE BLONDE",null,null,null,null,null,null,"TOM CLOUT"]
[10,"FISHER & PAYKEL",10,"B","10 FISHER & PAYKEL",null,null,null,"ROB FLANAGAN",null,null,"10 MINS",null,null,null,11,1,null,"FISHER & PAYKEL",null,null,null,null,null,null,"ANDREW CHAPMAN"]
[11,"MOJO WINE",6,"C","11 MOJO WINE",null,null,null,"LEE KNAPTON",null,null,null,"6 MINS.",null,null,7,1,null,"MOJO WINES",null,null,null,null,null,null,"ARCHIE MASSEY"]
[12,"LUMIX",9,"C","12  LUMIX",null,null,null,null,"JONATHAN WHITTY",null,null,"9 MINS.",null,null,10,1,null,"THE LUMIX BOAT",null,null,null,null,null,null,"JONATHAN WHITTY"]
[13,"COMPASSMARKETS.COM",9,"A","13  COMPASSMARKETS.COM",null,null,"KEAGAN YORK",null,null,null,"9 MINS.",null,null,null,10,1,null,"KENWOOD-RABBITOHS****",null,null,null,null,"BRETT VAN MUNSTER"]
[14,"THE KITCHEN MAKER",9,"B","14  THE KITCHEN MAKER",null,null,"JOHN SWEENY",null,null,null,"9 MINS.",null,null,null,10,1,null,"THE KITCHEN MAKER",null,null,null,null,null,"CAMERON MC DONALD"]
[15,"NOAKES SAILING",9,"C","15  NOAKESAILING",null,null,null,"SEAN LANGMAN",null,null,"9 MINS.",null,null,null,10,1,null,"SPECTRUM TRIMMING",null,null,null,null,null,"TBA"]
[16,"HAIER APPLIANCES",10,"B","16  HAIER APPLIANCES",null,null,"PEDRO VOZONE",null,null,"10 MINS.",null,null,null,null,11,1,null,"KENWOOD-RABBITOHS****",null,null,null,null,"ADAM BARNES"]
[17,"ILVE",10,"C","17  ILVE",null,null,null,null,"OLLIE HARTAS",null,null,null,"10 MINS.",null,8,-2,null,"TF COLLECT",null,null,null,null,null,null,null,"DAVE HASELDINE"]

{"sheet":"Schedule","index":25,"n_rows":57,"n_cols":25,"rows_kept":57,"cut":false,"hidden":false,"merged":[]}
["ID","Date","Hcp","Line 1","Line 2","Line 3","Entries"]
[1,"2014-10-12","3b","R. Watt Memorial Trophy","  ","",17,null,"October",12,"3b","R. Watt Memorial Trophy",null,null,null,null,null,null,null,null,"February",13,null,"JJ Giltinan Championship – Invitation Race"]
[2,{"$f":"B2+7","v":"2014-10-19"},"3b","Major A. Frizelle Trophy","    ","",17,null,"October",19,"3b","Major A. Frizelle Trophy"]
[3,{"$f":"B3+7","v":"2014-10-26"},null,"Club Championship – Race 1","Alf Beashel Memorial Trophy","",17,null,"October",26,null,"Club Championship – Race 1",null,null,"Alf Beashel Memorial Trophy"]
[5,"2014-11-02","3b","Mick Scully Memorial Trophy","   ","",17,null,"November",2,"3b","Mick Scully Memorial Trophy",null,null,null,null,null,null,null,null,"February",14,null,"JJ Giltinan Championship – Race 1"]
[6,"2014-11-09",null,"Club Championship – Race 2","Eric Bowen Memorial Trophy","",17,null,"November",9,null,"Club Championship – Race 2",null,null,"Eric Bowen Memorial Trophy",null,null,null,null,null,null,null,null,null,"George Calligeros Trophy"]
[9,"2014-11-16","3b","Chris Webb Memorial Trophy","   ","",17,null,"November",16,"3b","Chris Webb Memorial Trophy"]
[12,"2014-11-23",null,"Club Championship – Race 3","Cordukes Clubhouse Trophy","",17,null,"November",23,null,"Club Championship – Race 3",null,null,"Cordukes Clubhouse Trophy",null,null,null,null,null,"February",15,null,"JJ Giltinan Championship – Race 2"]
[14,"2014-11-30","3b","W.C. ‘Trappy’ Duncan Memorial Trophy","","",17,null,"November ",30,"3b","W.C. ‘Trappy’ Duncan Memorial Trophy",null,null,null,null,null,null,null,null,null,null,null,null,"Cliff Monkhouse Memorial Trophy"]
[17,"2014-12-07",null,"Club Championship – Race 4","YANDOO Trophy","",17,null,"December",7,null,"Club Championship – Race 4",null,null,"Yandoo Trophy"]
[19,"2014-12-14","3b","Syd. Barnett Jr. Memorial Trophy",null,"",17,null,"December",14,"3b","Syd. Barnett Jr. Memorial Trophy ",null,null,null,null,null,null,null,null,"February",17,null,"JJ Giltinan Championship – Race 3"]
[23,"2015-01-11",null,"NSW Championship – Race 1","Club Championship – Race 5","",17,null,"January",11,null,"NSW Championship – Race 1",null,null,"Club Championship – Race 5",null,null,null,null,null,null,null,null,null,"Alan Cole Memorial Trophy"]
[null,{"$f":"B12+7","v":"2015-01-18"},null,"NSW Championship – Race 2","Club Championship – Race 6","",17,null,"January",18,null,"NSW Championship – Race 2",null,null,"Club Championship – Race 6"]
[null,{"$f":"B13+7","v":"2015-01-25"},null,"NSW Championship – Race 3","Club Championship – Race 7","",17,null,"January",25,null,"NSW Championship – Race 3",null,null,"Club Championship – Race 7",null,null,null,null,null,"February",18,null,"JJ Giltinan Championship – Race 4"]
[29,"2015-01-26",null,"NSW Championship – Race 4","Club Championship – Race 8","Lord Mayor's Trophy",17,null,"January",26,null,"NSW Championship – Race 4",null,null,"Club Championship – Race 8",null,null,"Lord Mayor’s Trophy",null,null,null,null,null,null,"A.J. Reynolds Trophy"]
[31,"2015-02-01",null,"NSW Championship – Race 5","Club Championship – Race 9","",17,null,"February",1,null,"NSW Championship – Race 5",null,null,"Club Championship – Race 9"]
[35,"2015-02-08","3b","President’s Trophy",null,"",17,null,"February",8,"3b","President’s Trophy",null,null,null,null,null,null,null,null,"February",19,null,"JJ Giltinan Championship – Race 5"]
[39,"2015-03-01","3b","Queen of the Harbour",null,"",17,null,"March",1,"3b","Queen of the Harbour",null,null,null,null,null,null,null,null,null,null,null,"Bill Miller Memorial Trophy"]
[36,"2015-03-08",null,"Club Championship – Race 10","Commodore Cup","",17,null,"March",8,null,"Club Championship – Race 10",null,null,"Commodore Cup"]
[40,"2015-03-15",null,"Club Championship – Race 11","Alice Burton Memorial Trophy","",17,null,"March",15,null,"Club Championship – Race 11",null,null,"Alice Burton Memorial Trophy",null,null,null,null,"February",21,null,"JJ Giltinan Championship – Race 6"]
[41,"2015-03-22",null,null,null,"",17,null,null,null,null,null,null,null,null,null,null,null,null,null,null,null,null,"‘Big Kite’ Memorial Trophy"]
[42,null,null,null," "," ",17]
[null,null,null,null," "," ",17,null,"March","       20-23",null,"Australian Championship  (Brisbane)",null,null,null,null,null,null,null,"February",22,null,"JJ Giltinan Championship – Race 7"]
[null,null,null,null," "," ",17]
[null,null,null,null,null,null,17]
[]
[]
[]
[]
[]
[]
[]
[]
[43,"2013-02-15",null,"Giltinan Championship – Invitation","Eric Bowen Memorial Trophy"]
[44,{"$f":"B34+1","v":"2013-02-16"},null,"Giltinan Championship – Race 1","George Calligeros Trophy"]
[45,{"$f":"B35+1","v":"2013-02-17"},null,"Giltinan Championship – Race 2","Cliff Monkhouse Memorial Trophy"]
[null,"2013-02-19",null,"Giltinan Championship – Race 3","Alan Cole Memorial Trophy"]
[null,"2013-02-20",null,"Giltinan Championship – Race 4","A.J. Reynolds Trophy"]
[null,"2013-02-21",null,"Giltinan Championship – Race 5","Bill Miller Memorial Trophy"]
[null,"2013-02-23",null,"Giltinan Championship – Race 6","‘Big Kite’ Memorial trophy"]
[null,"2013-02-24",null,"Giltinan Championship – Race 7","Alf Beashel Memorial Trophy"]
[]
[]
[]
[]
[]
[]
[]
[]
[]
[]
[]
[]
[]
[]
[]
[null,null,null,null,null,null,null,null,null,null,null,null,null,null,null,null,null,null,null,null,null,"Club Championship - Race 9"]

{"sheet":"11-03-12","index":26,"n_rows":57,"n_cols":18,"rows_kept":57,"cut":false,"hidden":false,"merged":[[9,0,9,1],[0,0,0,7],[1,0,1,7],[3,0,3,1],[3,6,3,7],[7,0,7,1],[7,3,7,4],[7,5,7,7],[6,0,6,1],[48,0,48,2],[48,3,48,7],[12,15,12,16],[12,0,12,1],[12,4,12,6],[47,0,47,2],[47,3,47,7],[46,0,46,2],[46,3,46,7],[52,3,55,7],[53,0,53,1],[54,0,54,1],[49,0,49,2],[49,3,49,7],[51,3,51,7],[50,0,50,2],[50,3,50,7],[51,0,51,2]]}
["Australian 18 Footers League"]
["Race Officer's Report"]
[]
["Name of Race:",null,{"$f":"Schedule!$D22","v":0},"Entrants:",{"$f":"Schedule!G22","v":17},"Date:",{"$f":"Schedule!B22","v":"00:00:00"}]
[null,null,{"$f":"Schedule!$E22","v":" "}]
[null,null,{"$f":"Schedule!$F22","v":" "}]
["Course:",null,null,"Wind:",null,"Tide:"]
["Race Start Time:",null,null,"Race Finish Time :",null,{"$f":"D15","v":"00:00:00"},null,null,null,null,null,null,"Ctrl+Shift+R to formulate H/cap result."]
[]
["Start Mode:",null,{"$f":"IF(Schedule!C22=\"3b\",\"HANDICAP\",\"SCRATCH\")","v":"SCRATCH"}]
[null,"Non Starters:",0,"Non Finishers:",0,null,null,0]
[]
["Race Officer:",null,"Garry Linacre",null,null,null,null,null,null,null,null,null,"Entrants",null,null,"Result"]
["Finish Placings","Recall #","Boat Name","Finish Time","Elapsed Time","Handicap","Corrected Time",{"$f":"IF(C10=\"Scratch\",\"H/cap Position\",\"Scratch Position\")","v":"H/cap Position"},null,null,null,"Recall #","Boat Name","H/CAP",null,"Scratch","H/Cap"]
[1,null,{"$f":"IF(ISBLANK(B15),\"\",VLOOKUP(B15,L$15:M$45,2))","v":""},null,{"$f":"IF(ISBLANK(D15),\"\",D15-C$8)","v":""},{"$f":"IF(ISBLANK(B15),\"\",VLOOKUP(B15,L$15:N$45,3))","v":""},{"$f":"IF(ISBLANK(D15),\"\",IF(C$10=\"Scratch\",E15-TIME(,F15,),E15))","v":""},null,1,null,null,1,null,null,null,null,null,12]
[2,null,"",null,"","","",null,2,null,null,2,null,null,null,null,null,8]
[3,null,"",null,"","","",null,3,null,null,3,null,null,null,null,null,18]
[4,null,"",null,"","","",null,4,null,null,4,null,null,null,null,null,7]
[5,null,"",null,"","","",null,5,null,null,5,null,null,null,null,null,18]
[6,null,"",null,"","","",null,6,null,null,6,null,null,null,null,null,2]
[7,null,"",null,"","","",null,7,null,null,7,null,null,null,null,null,13]
[8,null,"",null,"","","",null,8,null,null,8,null,null,null,null,null,6]
[9,null,"",null,"","","",null,9,null,null,9,null,null,null,null,null,4]
[10,null,"",null,"","","",null,10,null,null,10,null,null,null,null,null,11]
[11,null,"",null,"","","",null,11,null,null,11,null,null,null,null,null,3]
[12,null,"",null,"","","",null,12,null,null,12,null,null,null,null,null,5]
[13,null,"",null,"","","",null,13,null,null,13,null,null,null,null,null,1]
[14,null,"",null,"","","",null,14,null,null,14,null,null,null,null,null,10]
[15,null,"",null,"","","",null,15,null,null,15,null,null,null,null,null,18]
[16,null,"",null,"","","",null,16,null,null,16,null,null,null,null,null,18]
[17,null,"",null,"","","",null,17,null,null,17,null,null,null,null,null,9]
[18,null,"",null,"","","",null,18,null,null,18,null,null,null,null,null,18]
[19,null,"",null,"","","",null,19,null,null,19,null,null,null,null,null,18]
[20,null,"",null,"","","",null,20,null,null,20,null,null,null,null,null,18]
[21,null,"",null,"","","",null,21,null,null,21,null,null,null,null,null,18]
[22,null,"",null,"","","",null,22,null,null,22,null,null,null,null,null,18]
[23,null,"",null,"","","",null,23,null,null,23,null,null,null,null,null,18]
[24,null,"",null,"","","",null,24,null,null,null,null,null,null,null,null,18]
[25,null,"",null,"","","",null,25]
[26,null,"",null,"","","",null,26]
[27,null,"",null,"","","",null,27]
[28,null,"",null,"","","",null,28]
[29,null,"",null,"","","",null,29]
[30,null,"",null,"","","",null,30]
[31,null,null,null,null,null,null,null,31]
[]
["Non Starters","Non Starters",null,"Non Finishers","Non Finishers"]
[]
[]
[]
[]
[]
[null,null,"Comments:"]
["Sailing Time:",null,{"$f":"E15","v":""}]
["Fastest Time:",null,{"$f":"C15","v":""}]
["Margins:","1st - 2nd",{"$f":"D16-D15","v":"00:00:00"}]
[null,"2nd - 3rd",{"$f":"D17-D16","v":"00:00:00"}]

{"sheet":"18-03-12","index":27,"n_rows":57,"n_cols":18,"rows_kept":57,"cut":false,"hidden":false,"merged":[[52,3,55,7],[53,0,53,1],[54,0,54,1],[49,0,49,2],[49,3,49,7],[51,3,51,7],[50,0,50,2],[50,3,50,7],[51,0,51,2],[48,0,48,2],[48,3,48,7],[12,15,12,16],[12,0,12,1],[12,4,12,6],[47,0,47,2],[47,3,47,7],[46,0,46,2],[46,3,46,7],[9,0,9,1],[0,0,0,7],[1,0,1,7],[3,0,3,1],[3,6,3,7],[7,0,7,1],[7,3,7,4],[7,5,7,7],[6,0,6,1]]}
["Australian 18 Footers League"]
["Race Officer's Report"]
[]
["Name of Race:",null,{"$f":"Schedule!$D23","v":0},"Entrants:",{"$f":"Schedule!G23","v":17},"Date:",{"$f":"Schedule!B23","v":"00:00:00"}]
[null,null,{"$f":"Schedule!$E23","v":" "}]
[null,null,{"$f":"Schedule!$F23","v":" "}]
["Course:",null,null,"Wind:",null,"Tide:"]
["Race Start Time:",null,null,"Race Finish Time :",null,{"$f":"D15","v":"00:00:00"},null,null,null,null,null,null,"Ctrl+Shift+R to formulate H/cap result."]
[]
["Start Mode:",null,{"$f":"IF(Schedule!C23=\"3b\",\"HANDICAP\",\"SCRATCH\")","v":"SCRATCH"}]
[null,"Non Starters:",0,"Non Finishers:",0,null,null,0]
[]
["Race Officer:",null,"Garry Linacre",null,null,null,null,null,null,null,null,null,"Entrants",null,null,"Result"]
["Finish Placings","Recall #","Boat Name","Finish Time","Elapsed Time","Handicap","Corrected Time",{"$f":"IF(C10=\"Scratch\",\"H/cap Position\",\"Scratch Position\")","v":"H/cap Position"},null,null,null,"Recall #","Boat Name","H/CAP",null,"Scratch","H/Cap"]
[1,null,{"$f":"IF(ISBLANK(B15),\"\",VLOOKUP(B15,L$15:M$45,2))","v":""},null,{"$f":"IF(ISBLANK(D15),\"\",D15-C$8)","v":""},{"$f":"IF(ISBLANK(B15),\"\",VLOOKUP(B15,L$15:N$45,3))","v":""},{"$f":"IF(ISBLANK(D15),\"\",IF(C$10=\"Scratch\",E15-TIME(,F15,),E15))","v":""},null,1,null,null,1,null,null,null,null,null,4]
[2,null,"",null,"","","",null,2,null,null,2,null,null,null,null,null,1]
[3,null,"",null,"","","",null,3,null,null,3,null,null,null,null,null,18]
[4,null,"",null,"","","",null,4,null,null,4,null,null,null,null,null,7]
[5,null,"",null,"","","",null,5,null,null,5,null,null,null,null,null,18]
[6,null,"",null,"","","",null,6,null,null,6,null,null,null,null,null,18]
[7,null,"",null,"","","",null,7,null,null,7,null,null,null,null,null,18]
[8,null,"",null,"","","",null,8,null,null,8,null,null,null,null,null,9]
[9,null,"",null,"","","",null,9,null,null,9,null,null,null,null,null,18]
[10,null,"",null,"","","",null,10,null,null,10,null,null,null,null,null,6]
[11,null,"",null,"","","",null,11,null,null,11,null,null,null,null,null,18]
[12,null,"",null,"","","",null,12,null,null,12,null,null,null,null,null,3]
[13,null,"",null,"","","",null,13,null,null,13,null,null,null,null,null,2]
[14,null,"",null,"","","",null,14,null,null,14,null,null,null,null,null,5]
[15,null,"",null,"","","",null,15,null,null,15,null,null,null,null,null,10]
[16,null,"",null,"","","",null,16,null,null,16,null,null,null,null,null,18]
[17,null,"",null,"","","",null,17,null,null,17,null,null,null,null,null,8]
[18,null,"",null,"","","",null,18,null,null,18,null,null,null,null,null,18]
[19,null,"",null,"","","",null,19,null,null,19,null,null,null,null,null,18]
[20,null,"",null,"","","",null,20,null,null,20,null,null,null,null,null,18]
[21,null,"",null,"","","",null,21,null,null,21,null,null,null,null,null,18]
[22,null,"",null,"","","",null,22,null,null,22,null,null,null,null,null,18]
[23,null,"",null,"","","",null,23,null,null,23,null,null,null,null,null,18]
[24,null,"",null,"","","",null,24,null,null,null,null,null,null,null,null,18]
[25,null,"",null,"","","",null,25]
[26,null,"",null,"","","",null,26]
[27,null,"",null,"","","",null,27]
[28,null,"",null,"","","",null,28]
[29,null,"",null,"","","",null,29]
[30,null,"",null,"","","",null,30]
[31,null,null,null,null,null,null,null,31]
[]
["Non Starters","Non Starters",null,"Non Finishers","Non Finishers"]
[]
[]
[]
[]
[]
[null,null,"Comments:"]
["Sailing Time:",null,{"$f":"E15","v":""}]
["Fastest Time:",null,{"$f":"C15","v":""}]
["Margins:","1st - 2nd",{"$f":"D16-D15","v":"00:00:00"}]
[null,"2nd - 3rd",{"$f":"D17-D16","v":"00:00:00"}]

{"sheet":"25-03-12","index":28,"n_rows":57,"n_cols":18,"rows_kept":57,"cut":false,"hidden":false,"merged":[[9,0,9,1],[0,0,0,7],[1,0,1,7],[3,0,3,1],[3,6,3,7],[7,0,7,1],[7,3,7,4],[7,5,7,7],[6,0,6,1],[48,0,48,2],[48,3,48,7],[12,15,12,16],[12,0,12,1],[12,4,12,6],[47,0,47,2],[47,3,47,7],[46,0,46,2],[46,3,46,7],[52,3,55,7],[53,0,53,1],[54,0,54,1],[49,0,49,2],[49,3,49,7],[51,3,51,7],[50,0,50,2],[50,3,50,7],[51,0,51,2]]}
["Australian 18 Footers League"]
["Race Officer's Report"]
[]
["Name of Race:",null,{"$f":"Schedule!$D24","v":0},"Entrants:",{"$f":"Schedule!G24","v":17},"Date:",{"$f":"Schedule!B24","v":"00:00:00"}]
[null,null,{"$f":"Schedule!$E24","v":" "}]
[null,null,{"$f":"Schedule!$F2","v":""}]
["Course:",null,null,"Wind:",null,"Tide:"]
["Race Start Time:",null,null,"Race Finish Time :",null,{"$f":"D15","v":"00:00:00"},null,null,null,null,null,null,"Ctrl+Shift+R to formulate H/cap result."]
[]
["Start Mode:",null,{"$f":"IF(Schedule!C24=\"3b\",\"HANDICAP\",\"SCRATCH\")","v":"SCRATCH"}]
[null,"Non Starters:",0,"Non Finishers:",0,null,null,0]
[]
["Race Officer:",null,"Garry Linacre",null,null,null,null,null,null,null,null,null,"Entrants",null,null,"Result"]
["Finish Placings","Recall #","Boat Name","Finish Time","Elapsed Time","Handicap","Corrected Time",{"$f":"IF(C10=\"Scratch\",\"H/cap Position\",\"Scratch Position\")","v":"H/cap Position"},null,null,null,"Recall #","Boat Name","H/CAP",null,"Scratch","H/Cap"]
[1,null,{"$f":"IF(ISBLANK(B15),\"\",VLOOKUP(B15,L$15:M$45,2))","v":""},null,{"$f":"IF(ISBLANK(D15),\"\",D15-C$8)","v":""},{"$f":"IF(ISBLANK(B15),\"\",VLOOKUP(B15,L$15:N$45,3))","v":""},{"$f":"IF(ISBLANK(D15),\"\",IF(C$10=\"Scratch\",E15-TIME(,F15,),E15))","v":""},null,1,null,null,1,null,null,null,null,null,4]
[2,null,"",null,"","","",null,2,null,null,2,null,null,null,null,null,5]
[3,null,"",null,"","","",null,3,null,null,3,null,null,null,null,null,18]
[4,null,"",null,"","","",null,4,null,null,4,null,null,null,null,null,6]
[5,null,"",null,"","","",null,5,null,null,5,null,null,null,null,null,3]
[6,null,"",null,"","","",null,6,null,null,6,null,null,null,null,null,1]
[7,null,"",null,"","","",null,7,null,null,7,null,null,null,null,null,2]
[8,null,"",null,"","","",null,8,null,null,8,null,null,null,null,null,8]
[9,null,"",null,"","","",null,9,null,null,9,null,null,null,null,null,13]
[10,null,"",null,"","","",null,10,null,null,10,null,null,null,null,null,11]
[11,null,"",null,"","","",null,11,null,null,11,null,null,null,null,null,18]
[12,null,"",null,"","","",null,12,null,null,12,null,null,null,null,null,12]
[13,null,"",null,"","","",null,13,null,null,13,null,null,null,null,null,10]
[14,null,"",null,"","","",null,14,null,null,14,null,null,null,null,null,9]
[15,null,"",null,"","","",null,15,null,null,15,null,null,null,null,null,7]
[16,null,"",null,"","","",null,16,null,null,16,null,null,null,null,null,18]
[17,null,"",null,"","","",null,17,null,null,17,null,null,null,null,null,14]
[18,null,"",null,"","","",null,18,null,null,18,null,null,null,null,null,18]
[19,null,"",null,"","","",null,19,null,null,19,null,null,null,null,null,18]
[20,null,"",null,"","","",null,20,null,null,20,null,null,null,null,null,18]
[21,null,"",null,"","","",null,21,null,null,21,null,null,null,null,null,18]
[22,null,"",null,"","","",null,22,null,null,22,null,null,null,null,null,18]
[23,null,"",null,"","","",null,23,null,null,23,null,null,null,null,null,18]
[24,null,"",null,"","","",null,24,null,null,null,null,null,null,null,null,18]
[25,null,"",null,"","","",null,25]
[26,null,"",null,"","","",null,26]
[27,null,"",null,"","","",null,27]
[28,null,"",null,"","","",null,28]
[29,null,"",null,"","","",null,29]
[30,null,"",null,"","","",null,30]
[31,null,null,null,null,null,null,null,31]
[]
["Non Starters","Non Starters",null,"Non Finishers","Non Finishers"]
[]
[]
[]
[]
[]
[null,null,"Comments:"]
["Sailing Time:",null,{"$f":"E15","v":""}]
["Fastest Time:",null,{"$f":"C15","v":""}]
["Margins:","1st - 2nd",{"$f":"D16-D15","v":"00:00:00"}]
[null,"2nd - 3rd",{"$f":"D17-D16","v":"00:00:00"}]

{"sheet":"Point Score OLD","index":29,"n_rows":148,"n_cols":37,"rows_kept":148,"cut":false,"hidden":false,"merged":[]}
["AUSTRALIAN 18Ft League - 2011/12 Club Championship Point Score",null,null,null,null,null,null,null,null,null,null,null,null,null,null,null,null,null,null,null,null,null,null,null,null,null,null,null,null,null,null,"Ctrl+R to Sort by Recall"]
[null,null,{"$f":"'23-11-14'!G4","v":"2014-11-23"},{"$f":"'30-11-14'!G4","v":"2014-11-30"},{"$f":"'7-12-14'!G4","v":"2014-12-07"},{"$f":"'14-12-14'!G4","v":"2014-12-14"},{"$f":"'11-01-15'!G4","v":"2015-01-11"},{"$f":"'25-01-15'!G4","v":"2015-01-25"},{"$f":"'26-01-15'!G4","v":"2015-01-26"},{"$f":"'1-02-15'!G4","v":"2015-02-01"},{"$f":"'8-02-15'!G4","v":"2015-02-08"},{"$f":"'1-03-15'!G4","v":"2015-03-01"},{"$f":"'25-03-12'!G4","v":"00:00:00"},null,null,null,null,null,null,null,null,null,null,null,null,null,null,null,null,null,null,"Ctrl+S to Sort by Points"]
["Recall","Name","R1","R2","R3","R4","R5","R6","R7","R8","R9","R10","R11",null,null,null,null,"Total","POS",null,null,null,null,null,null,null,null,null,null,null,null,"R3"]
[1,"THURLOW FISHER LAWYERS",{"$f":"'23-11-14'!$P15","v":0},{"$f":"'30-11-14'!$P15","v":0},{"$f":"'7-12-14'!$P15","v":0},{"$f":"'14-12-14'!$P15","v":0},{"$f":"'11-01-15'!$P15","v":0},{"$f":"'25-01-15'!$P15","v":0},{"$f":"'26-01-15'!$P15","v":0},{"$f":"'1-02-15'!$P15","v":0},{"$f":"'8-02-15'!$P15","v":0},{"$f":"'1-03-15'!$P15","v":0},{"$f":"'25-03-12'!$P15","v":0},null,null,null,null,{"$f":"SUM(C4:Q4)","v":0},1]
[2,"YANDOO",{"$f":"'23-11-14'!$P16","v":0},{"$f":"'30-11-14'!$P16","v":0},{"$f":"'7-12-14'!$P16","v":0},{"$f":"'14-12-14'!$P16","v":0},{"$f":"'11-01-15'!$P16","v":0},{"$f":"'25-01-15'!$P16","v":0},{"$f":"'26-01-15'!$P16","v":0},{"$f":"'1-02-15'!$P16","v":0},{"$f":"'8-02-15'!$P16","v":0},{"$f":"'1-03-15'!$P16","v":0},{"$f":"'25-03-12'!$P16","v":0},null,null,null,null,0,2]
[3,"ASKO APPLIANCES",{"$f":"'23-11-14'!$P17","v":0},{"$f":"'30-11-14'!$P17","v":0},{"$f":"'7-12-14'!$P17","v":0},{"$f":"'14-12-14'!$P17","v":0},{"$f":"'11-01-15'!$P17","v":0},{"$f":"'25-01-15'!$P17","v":0},{"$f":"'26-01-15'!$P17","v":0},{"$f":"'1-02-15'!$P17","v":0},{"$f":"'8-02-15'!$P17","v":0},{"$f":"'1-03-15'!$P17","v":0},{"$f":"'25-03-12'!$P17","v":0},null,null,null,null,0,3]
[4,"DE'LONGHI-RABBITOHS",{"$f":"'23-11-14'!$P18","v":0},{"$f":"'30-11-14'!$P18","v":0},{"$f":"'7-12-14'!$P18","v":0},{"$f":"'14-12-14'!$P18","v":0},{"$f":"'11-01-15'!$P18","v":0},{"$f":"'25-01-15'!$P18","v":0},{"$f":"'26-01-15'!$P18","v":0},{"$f":"'1-02-15'!$P18","v":0},{"$f":"'8-02-15'!$P18","v":0},{"$f":"'1-03-15'!$P18","v":0},{"$f":"'25-03-12'!$P18","v":0},null,null,null,null,0,4]
[5,"APPLIANCESONLINE.COM.AU",{"$f":"'23-11-14'!$P19","v":0},{"$f":"'30-11-14'!$P19","v":0},{"$f":"'7-12-14'!$P19","v":0},{"$f":"'14-12-14'!$P19","v":0},{"$f":"'11-01-15'!$P19","v":0},{"$f":"'25-01-15'!$P19","v":0},{"$f":"'26-01-15'!$P19","v":0},{"$f":"'1-02-15'!$P19","v":0},{"$f":"'8-02-15'!$P19","v":0},{"$f":"'1-03-15'!$P19","v":0},{"$f":"'25-03-12'!$P19","v":0},null,null,null,null,0,5]
[6,"RAG & FAMISH HOTEL",{"$f":"'23-11-14'!$P20","v":0},{"$f":"'30-11-14'!$P20","v":0},{"$f":"'7-12-14'!$P20","v":0},{"$f":"'14-12-14'!$P20","v":0},{"$f":"'11-01-15'!$P20","v":0},{"$f":"'25-01-15'!$P20","v":0},{"$f":"'26-01-15'!$P20","v":0},{"$f":"'1-02-15'!$P20","v":0},{"$f":"'8-02-15'!$P20","v":0},{"$f":"'1-03-15'!$P20","v":0},{"$f":"'25-03-12'!$P20","v":0},null,null,null,null,0,6]
[7,"GOTTA LOVE IT 7",{"$f":"'23-11-14'!$P21","v":0},{"$f":"'30-11-14'!$P21","v":0},{"$f":"'7-12-14'!$P21","v":0},{"$f":"'14-12-14'!$P21","v":0},{"$f":"'11-01-15'!$P21","v":0},{"$f":"'25-01-15'!$P21","v":0},{"$f":"'26-01-15'!$P21","v":0},{"$f":"'1-02-15'!$P21","v":0},{"$f":"'8-02-15'!$P21","v":0},{"$f":"'1-03-15'!$P21","v":0},{"$f":"'25-03-12'!$P21","v":0},null,null,null,null,0,7]
[8,"SMEG",{"$f":"'23-11-14'!$P22","v":0},{"$f":"'30-11-14'!$P22","v":0},{"$f":"'7-12-14'!$P22","v":0},{"$f":"'14-12-14'!$P22","v":0},{"$f":"'11-01-15'!$P22","v":0},{"$f":"'25-01-15'!$P22","v":0},{"$f":"'26-01-15'!$P22","v":0},{"$f":"'1-02-15'!$P22","v":0},{"$f":"'8-02-15'!$P22","v":0},{"$f":"'1-03-15'!$P22","v":0},{"$f":"'25-03-12'!$P22","v":0},null,null,null,null,0,8]
[9,"PURE BLONDE",{"$f":"'23-11-14'!$P23","v":0},{"$f":"'30-11-14'!$P23","v":0},{"$f":"'7-12-14'!$P23","v":0},{"$f":"'14-12-14'!$P23","v":0},{"$f":"'11-01-15'!$P23","v":0},{"$f":"'25-01-15'!$P23","v":0},{"$f":"'26-01-15'!$P23","v":0},{"$f":"'1-02-15'!$P23","v":0},{"$f":"'8-02-15'!$P23","v":0},{"$f":"'1-03-15'!$P23","v":0},{"$f":"'25-03-12'!$P23","v":0},null,null,null,null,0,9]
[10,"FISHER & PAYKEL",{"$f":"'23-11-14'!$P24","v":0},{"$f":"'30-11-14'!$P24","v":0},{"$f":"'7-12-14'!$P24","v":0},{"$f":"'14-12-14'!$P24","v":0},{"$f":"'11-01-15'!$P24","v":0},{"$f":"'25-01-15'!$P24","v":0},{"$f":"'26-01-15'!$P24","v":0},{"$f":"'1-02-15'!$P24","v":0},{"$f":"'8-02-15'!$P24","v":0},{"$f":"'1-03-15'!$P24","v":0},{"$f":"'25-03-12'!$P24","v":0},null,null,null,null,0,10]
[11,"RED CLAW",{"$f":"'23-11-14'!$P25","v":0},{"$f":"'30-11-14'!$P25","v":0},{"$f":"'7-12-14'!$P25","v":0},{"$f":"'14-12-14'!$P25","v":0},{"$f":"'11-01-15'!$P25","v":0},{"$f":"'25-01-15'!$P25","v":0},{"$f":"'26-01-15'!$P25","v":0},{"$f":"'1-02-15'!$P25","v":0},{"$f":"'8-02-15'!$P25","v":0},{"$f":"'1-03-15'!$P25","v":0},{"$f":"'25-03-12'!$P25","v":0},null,null,null,null,0,11]
[12,"PANASONIC",{"$f":"'23-11-14'!$P26","v":0},{"$f":"'30-11-14'!$P26","v":0},{"$f":"'7-12-14'!$P26","v":0},{"$f":"'14-12-14'!$P26","v":0},{"$f":"'11-01-15'!$P26","v":0},{"$f":"'25-01-15'!$P26","v":0},{"$f":"'26-01-15'!$P26","v":0},{"$f":"'1-02-15'!$P26","v":0},{"$f":"'8-02-15'!$P26","v":0},{"$f":"'1-03-15'!$P26","v":0},{"$f":"'25-03-12'!$P26","v":0},null,null,null,null,0,12]
[13,"KENWOOD-RABBITOHS",{"$f":"'23-11-14'!$P27","v":0},{"$f":"'30-11-14'!$P27","v":0},{"$f":"'7-12-14'!$P27","v":0},{"$f":"'14-12-14'!$P27","v":0},{"$f":"'11-01-15'!$P27","v":0},{"$f":"'25-01-15'!$P27","v":0},{"$f":"'26-01-15'!$P27","v":0},{"$f":"'1-02-15'!$P27","v":0},{"$f":"'8-02-15'!$P27","v":0},{"$f":"'1-03-15'!$P27","v":0},{"$f":"'25-03-12'!$P27","v":0},null,null,null,null,0,13]
[14,"TF COLLECT",{"$f":"'23-11-14'!$P28","v":0},{"$f":"'30-11-14'!$P28","v":0},{"$f":"'7-12-14'!$P28","v":0},{"$f":"'14-12-14'!$P28","v":0},{"$f":"'11-01-15'!$P28","v":0},{"$f":"'25-01-15'!$P28","v":0},{"$f":"'26-01-15'!$P28","v":0},{"$f":"'1-02-15'!$P28","v":0},{"$f":"'8-02-15'!$P28","v":0},{"$f":"'1-03-15'!$P28","v":0},{"$f":"'25-03-12'!$P28","v":0},null,null,null,null,0,14]
[15,"THE KITCHEN MAKER",{"$f":"'23-11-14'!$P29","v":0},{"$f":"'30-11-14'!$P29","v":0},{"$f":"'7-12-14'!$P29","v":0},{"$f":"'14-12-14'!$P29","v":0},{"$f":"'11-01-15'!$P29","v":0},{"$f":"'25-01-15'!$P29","v":0},{"$f":"'26-01-15'!$P29","v":0},{"$f":"'1-02-15'!$P29","v":0},{"$f":"'8-02-15'!$P29","v":0},{"$f":"'1-03-15'!$P29","v":0},{"$f":"'25-03-12'!$P29","v":0},null,null,null,null,0,15]
[16,"PROJECT RACING",{"$f":"'23-11-14'!$P30","v":0},{"$f":"'30-11-14'!$P30","v":0},{"$f":"'7-12-14'!$P30","v":0},{"$f":"'14-12-14'!$P30","v":0},{"$f":"'11-01-15'!$P30","v":0},{"$f":"'25-01-15'!$P30","v":0},{"$f":"'26-01-15'!$P30","v":0},{"$f":"'1-02-15'!$P30","v":0},{"$f":"'8-02-15'!$P30","v":0},{"$f":"'1-03-15'!$P30","v":0},{"$f":"'25-03-12'!$P30","v":0},null,null,null,null,0,16]
[17,"TEAM PARKINSON",{"$f":"'23-11-14'!$P31","v":0},{"$f":"'30-11-14'!$P31","v":0},{"$f":"'7-12-14'!$P31","v":0},{"$f":"'14-12-14'!$P31","v":0},{"$f":"'11-01-15'!$P31","v":0},{"$f":"'25-01-15'!$P31","v":0},{"$f":"'26-01-15'!$P31","v":0},{"$f":"'1-02-15'!$P31","v":0},{"$f":"'8-02-15'!$P31","v":0},{"$f":"'1-03-15'!$P31","v":0},{"$f":"'25-03-12'!$P31","v":0},null,null,null,null,0,17]
[18,null,{"$f":"'2-11-14'!$P32","v":0},{"$f":"'9-11-14'!$P32","v":0},{"$f":"'16-11-14'!$P32","v":0},{"$f":"'23-11-14'!$P32","v":0},{"$f":"'30-11-14'!$P32","v":0},{"$f":"'7-12-14'!$P32","v":0},{"$f":"'11-01-15'!$P32","v":0},{"$f":"'18-01-15'!$P32","v":0},{"$f":"'25-01-15'!$P32","v":0},{"$f":"'26-01-15'!$P32","v":0},{"$f":"'1-02-15'!$P32","v":0},{"$f":"'1-03-15'!$P32","v":0},{"$f":"'8-03-15'!$P32","v":0},{"$f":"'22-03-15'!$P32","v":0},null,null,{"$f":"S20+1","v":18}]
[19,null,{"$f":"'2-11-14'!$P33","v":0},{"$f":"'9-11-14'!$P33","v":0},{"$f":"'16-11-14'!$P33","v":0},{"$f":"'23-11-14'!$P33","v":0},{"$f":"'30-11-14'!$P33","v":0},{"$f":"'7-12-14'!$P33","v":0},{"$f":"'11-01-15'!$P33","v":0},{"$f":"'18-01-15'!$P33","v":0},{"$f":"'25-01-15'!$P33","v":0},{"$f":"'26-01-15'!$P33","v":0},{"$f":"'1-02-15'!$P33","v":0},{"$f":"'1-03-15'!$P33","v":0},{"$f":"'8-03-15'!$P33","v":0},{"$f":"'22-03-15'!$P33","v":0},null,null,19]
[20,null,{"$f":"'2-11-14'!$P34","v":0},{"$f":"'9-11-14'!$P34","v":0},{"$f":"'16-11-14'!$P34","v":0},{"$f":"'23-11-14'!$P34","v":0},{"$f":"'30-11-14'!$P34","v":0},{"$f":"'7-12-14'!$P34","v":0},{"$f":"'11-01-15'!$P34","v":0},{"$f":"'18-01-15'!$P34","v":0},{"$f":"'25-01-15'!$P34","v":0},{"$f":"'26-01-15'!$P34","v":0},{"$f":"'1-02-15'!$P34","v":0},{"$f":"'1-03-15'!$P34","v":0},{"$f":"'8-03-15'!$P34","v":0},{"$f":"'22-03-15'!$P34","v":0},null,null,20]
[21,null,{"$f":"'2-11-14'!$P35","v":0},{"$f":"'9-11-14'!$P35","v":0},{"$f":"'16-11-14'!$P35","v":0},{"$f":"'23-11-14'!$P35","v":0},{"$f":"'30-11-14'!$P35","v":0},{"$f":"'7-12-14'!$P35","v":0},{"$f":"'11-01-15'!$P35","v":0},{"$f":"'18-01-15'!$P35","v":0},{"$f":"'25-01-15'!$P35","v":0},{"$f":"'26-01-15'!$P35","v":0},{"$f":"'1-02-15'!$P35","v":0},{"$f":"'1-03-15'!$P35","v":0},{"$f":"'8-03-15'!$P35","v":0},{"$f":"'22-03-15'!$P35","v":0},{"$f":"'18-03-12'!$P35","v":0},null,21]
[22,null,{"$f":"'2-11-14'!$P36","v":0},{"$f":"'9-11-14'!$P36","v":0},{"$f":"'16-11-14'!$P36","v":0},{"$f":"'23-11-14'!$P36","v":0},{"$f":"'30-11-14'!$P36","v":0},{"$f":"'7-12-14'!$P36","v":0},{"$f":"'11-01-15'!$P36","v":0},{"$f":"'18-01-15'!$P36","v":0},{"$f":"'25-01-15'!$P36","v":0},{"$f":"'26-01-15'!$P36","v":0},{"$f":"'1-02-15'!$P36","v":0},{"$f":"'1-03-15'!$P36","v":0},{"$f":"'8-03-15'!$P36","v":0},{"$f":"'22-03-15'!$P36","v":0},{"$f":"'18-03-12'!$P36","v":0},null,22]
[23,null,{"$f":"'2-11-14'!$P37","v":0},{"$f":"'9-11-14'!$P37","v":0},{"$f":"'16-11-14'!$P37","v":0},{"$f":"'23-11-14'!$P37","v":0},{"$f":"'30-11-14'!$P37","v":0},{"$f":"'7-12-14'!$P37","v":0},{"$f":"'11-01-15'!$P37","v":0},{"$f":"'18-01-15'!$P37","v":0},{"$f":"'25-01-15'!$P37","v":0},{"$f":"'26-01-15'!$P37","v":0},{"$f":"'1-02-15'!$P37","v":0},{"$f":"'1-03-15'!$P37","v":0},{"$f":"'8-03-15'!$P37","v":0},{"$f":"'22-03-15'!$P37","v":0},{"$f":"'18-03-12'!$P37","v":0},null,23]
[]
[]
["Notes:"]
[]
[]
["AUSTRALIAN 18Ft League - 2011/12 Season Handicap Point Score"]
[null,null,{"$f":"'12-10-14'!G4","v":"2014-10-12"},{"$f":"'19-10-14'!G4","v":"2014-10-19"},{"$f":"'26-10-14'!$G4","v":"2014-10-26"},{"$f":"'2-11-14'!$G4","v":"2014-11-02"},{"$f":"'9-11-14'!$G4","v":"2014-11-09"},{"$f":"'16-11-14'!$G4","v":"2014-11-16"},{"$f":"'23-11-14'!$G4","v":"2014-11-23"},{"$f":"'30-11-14'!$G4","v":"2014-11-30"},{"$f":"'7-12-14'!$G4","v":"2014-12-07"},{"$f":"'14-12-14'!$G4","v":"2014-12-14"},{"$f":"'11-01-15'!$G4","v":"2015-01-11"},{"$f":"'18-01-15'!$G4","v":"2015-01-18"},{"$f":"'25-01-15'!$G4","v":"2015-01-25"},{"$f":"'26-01-15'!$G4","v":"2015-01-26"},{"$f":"'1-02-15'!$G4","v":"2015-02-01"},{"$f":"'8-02-15'!$G4","v":"2015-02-08"},{"$f":"'1-03-15'!$G4","v":"2015-03-01"},{"$f":"'8-03-15'!$G4","v":"2015-03-08"},{"$f":"'15-03-15'!$G4","v":"2015-03-15"},{"$f":"'22-03-15'!$G4","v":"2015-03-22"},{"$f":"'11-03-12'!$G4","v":"00:00:00"},{"$f":"'18-03-12'!$G4","v":"00:00:00"},{"$f":"'25-03-12'!$G4","v":"00:00:00"}]
["Recall","Name","R1","R2","R3","R4","R5","R6","R7","R8","R9","R10","R11","R12","R13","R14","R15","R16","R17","T1","R19","R20","R21","R22","R23","Total","POS"]
[1,"THURLOW FISHER LAWYERS",{"$f":"'12-10-14'!Q15","v":1},{"$f":"'19-10-14'!Q15","v":2},{"$f":"'26-10-14'!$Q15","v":0},{"$f":"'2-11-14'!$Q15","v":0},{"$f":"'9-11-14'!$Q15","v":0},{"$f":"'16-11-14'!$Q15","v":0},{"$f":"'23-11-14'!$Q15","v":0},{"$f":"'30-11-14'!$Q15","v":0},{"$f":"'7-12-14'!$Q15","v":0},{"$f":"'14-12-14'!$Q15","v":0},{"$f":"'11-01-15'!$Q15","v":0},{"$f":"'18-01-15'!$Q15","v":0},{"$f":"'25-01-15'!$Q15","v":0},{"$f":"'26-01-15'!$Q15","v":0},{"$f":"'1-02-15'!$Q15","v":0},{"$f":"'8-02-15'!$Q15","v":0},{"$f":"'1-03-15'!$Q15","v":0},{"$f":"'8-03-15'!$Q15","v":0},{"$f":"'15-03-15'!$Q15","v":0},{"$f":"'22-03-15'!$Q15","v":0},{"$f":"'11-03-12'!$Q15","v":0},{"$f":"'18-03-12'!$Q15","v":0},{"$f":"'25-03-12'!$Q33","v":0},{"$f":"SUM(C35:Y35)","v":3},1]
[2,"YANDOO",{"$f":"'12-10-14'!Q16","v":8},{"$f":"'19-10-14'!Q16","v":4},{"$f":"'26-10-14'!$Q16","v":0},{"$f":"'2-11-14'!$Q16","v":0},{"$f":"'9-11-14'!$Q16","v":0},{"$f":"'16-11-14'!$Q16","v":0},{"$f":"'23-11-14'!$Q16","v":0},{"$f":"'30-11-14'!$Q16","v":0},{"$f":"'7-12-14'!$Q16","v":0},{"$f":"'14-12-14'!$Q16","v":0},{"$f":"'11-01-15'!$Q16","v":0},{"$f":"'18-01-15'!$Q16","v":0},{"$f":"'25-01-15'!$Q16","v":0},{"$f":"'26-01-15'!$Q16","v":0},{"$f":"'1-02-15'!$Q16","v":0},{"$f":"'8-02-15'!$Q16","v":0},{"$f":"'1-03-15'!$Q16","v":0},{"$f":"'8-03-15'!$Q16","v":0},{"$f":"'15-03-15'!$Q16","v":0},{"$f":"'22-03-15'!$Q16","v":0},{"$f":"'11-03-12'!$Q16","v":0},{"$f":"'18-03-12'!$Q16","v":0},{"$f":"'25-03-12'!$Q34","v":0},12,2]
[3,"ASKO APPLIANCES",{"$f":"'12-10-14'!Q17","v":2},{"$f":"'19-10-14'!Q17","v":7},{"$f":"'26-10-14'!$Q17","v":0},{"$f":"'2-11-14'!$Q17","v":0},{"$f":"'9-11-14'!$Q17","v":0},{"$f":"'16-11-14'!$Q17","v":0},{"$f":"'23-11-14'!$Q17","v":0},{"$f":"'30-11-14'!$Q17","v":0},{"$f":"'7-12-14'!$Q17","v":0},{"$f":"'14-12-14'!$Q17","v":0},{"$f":"'11-01-15'!$Q17","v":0},{"$f":"'18-01-15'!$Q17","v":0},{"$f":"'25-01-15'!$Q17","v":0},{"$f":"'26-01-15'!$Q17","v":0},{"$f":"'1-02-15'!$Q17","v":0},{"$f":"'8-02-15'!$Q17","v":0},{"$f":"'1-03-15'!$Q17","v":0},{"$f":"'8-03-15'!$Q17","v":0},{"$f":"'15-03-15'!$Q17","v":0},{"$f":"'22-03-15'!$Q17","v":0},{"$f":"'11-03-12'!$Q17","v":0},{"$f":"'18-03-12'!$Q17","v":0},{"$f":"'25-03-12'!$Q35","v":0},9,3]
[4,"DE'LONGHI-RABBITOHS",{"$f":"'12-10-14'!Q18","v":18},{"$f":"'19-10-14'!Q18","v":10},{"$f":"'26-10-14'!$Q18","v":0},{"$f":"'2-11-14'!$Q18","v":0},{"$f":"'9-11-14'!$Q18","v":0},{"$f":"'16-11-14'!$Q18","v":0},{"$f":"'23-11-14'!$Q18","v":0},{"$f":"'30-11-14'!$Q18","v":0},{"$f":"'7-12-14'!$Q18","v":0},{"$f":"'14-12-14'!$Q18","v":0},{"$f":"'11-01-15'!$Q18","v":0},{"$f":"'18-01-15'!$Q18","v":0},{"$f":"'25-01-15'!$Q18","v":0},{"$f":"'26-01-15'!$Q18","v":0},{"$f":"'1-02-15'!$Q18","v":0},{"$f":"'8-02-15'!$Q18","v":0},{"$f":"'1-03-15'!$Q18","v":0},{"$f":"'8-03-15'!$Q18","v":0},{"$f":"'15-03-15'!$Q18","v":0},{"$f":"'22-03-15'!$Q18","v":0},{"$f":"'11-03-12'!$Q18","v":0},{"$f":"'18-03-12'!$Q18","v":0},{"$f":"'25-03-12'!$Q36","v":0},28,4]
[5,"APPLIANCESONLINE.COM.AU",{"$f":"'12-10-14'!Q19","v":6},{"$f":"'19-10-14'!Q19","v":6},{"$f":"'26-10-14'!$Q19","v":0},{"$f":"'2-11-14'!$Q19","v":0},{"$f":"'9-11-14'!$Q19","v":0},{"$f":"'16-11-14'!$Q19","v":0},{"$f":"'23-11-14'!$Q19","v":0},{"$f":"'30-11-14'!$Q19","v":0},{"$f":"'7-12-14'!$Q19","v":0},{"$f":"'14-12-14'!$Q19","v":0},{"$f":"'11-01-15'!$Q19","v":0},{"$f":"'18-01-15'!$Q19","v":0},{"$f":"'25-01-15'!$Q19","v":0},{"$f":"'26-01-15'!$Q19","v":0},{"$f":"'1-02-15'!$Q19","v":0},{"$f":"'8-02-15'!$Q19","v":0},{"$f":"'1-03-15'!$Q19","v":0},{"$f":"'8-03-15'!$Q19","v":0},{"$f":"'15-03-15'!$Q19","v":0},{"$f":"'22-03-15'!$Q19","v":0},{"$f":"'11-03-12'!$Q19","v":0},{"$f":"'18-03-12'!$Q19","v":0},{"$f":"'25-03-12'!$Q37","v":0},12,5]
[6,"RAG & FAMISH HOTEL",{"$f":"'12-10-14'!Q20","v":7},{"$f":"'19-10-14'!Q20","v":3},{"$f":"'26-10-14'!$Q20","v":0},{"$f":"'2-11-14'!$Q20","v":0},{"$f":"'9-11-14'!$Q20","v":0},{"$f":"'16-11-14'!$Q20","v":0},{"$f":"'23-11-14'!$Q20","v":0},{"$f":"'30-11-14'!$Q20","v":0},{"$f":"'7-12-14'!$Q20","v":0},{"$f":"'14-12-14'!$Q20","v":0},{"$f":"'11-01-15'!$Q20","v":0},{"$f":"'18-01-15'!$Q20","v":0},{"$f":"'25-01-15'!$Q20","v":0},{"$f":"'26-01-15'!$Q20","v":0},{"$f":"'1-02-15'!$Q20","v":0},{"$f":"'8-02-15'!$Q20","v":0},{"$f":"'1-03-15'!$Q20","v":0},{"$f":"'8-03-15'!$Q20","v":0},{"$f":"'15-03-15'!$Q20","v":0},{"$f":"'22-03-15'!$Q20","v":0},{"$f":"'11-03-12'!$Q20","v":0},{"$f":"'18-03-12'!$Q20","v":0},{"$f":"'25-03-12'!$Q38","v":0},10,6]
[7,"GOTTA LOVE IT 7",{"$f":"'12-10-14'!Q21","v":3},{"$f":"'19-10-14'!Q21","v":1},{"$f":"'26-10-14'!$Q21","v":0},{"$f":"'2-11-14'!$Q21","v":0},{"$f":"'9-11-14'!$Q21","v":0},{"$f":"'16-11-14'!$Q21","v":0},{"$f":"'23-11-14'!$Q21","v":0},{"$f":"'30-11-14'!$Q21","v":0},{"$f":"'7-12-14'!$Q21","v":0},{"$f":"'14-12-14'!$Q21","v":0},{"$f":"'11-01-15'!$Q21","v":0},{"$f":"'18-01-15'!$Q21","v":0},{"$f":"'25-01-15'!$Q21","v":0},{"$f":"'26-01-15'!$Q21","v":0},{"$f":"'1-02-15'!$Q21","v":0},{"$f":"'8-02-15'!$Q21","v":0},{"$f":"'1-03-15'!$Q21","v":0},{"$f":"'8-03-15'!$Q21","v":0},{"$f":"'15-03-15'!$Q21","v":0},{"$f":"'22-03-15'!$Q21","v":0},{"$f":"'11-03-12'!$Q21","v":0},{"$f":"'18-03-12'!$Q21","v":0},{"$f":"'25-03-12'!$Q39","v":0},4,7,null,null,null,null,null,null,null,null,null,{"$f":"AI41+AJ41","v":0}]
[8,"SMEG",{"$f":"'12-10-14'!Q22","v":5},{"$f":"'19-10-14'!Q22","v":9},{"$f":"'26-10-14'!$Q22","v":0},{"$f":"'2-11-14'!$Q22","v":0},{"$f":"'9-11-14'!$Q22","v":0},{"$f":"'16-11-14'!$Q22","v":0},{"$f":"'23-11-14'!$Q22","v":0},{"$f":"'30-11-14'!$Q22","v":0},{"$f":"'7-12-14'!$Q22","v":0},{"$f":"'14-12-14'!$Q22","v":0},{"$f":"'11-01-15'!$Q22","v":0},{"$f":"'18-01-15'!$Q22","v":0},{"$f":"'25-01-15'!$Q22","v":0},{"$f":"'26-01-15'!$Q22","v":0},{"$f":"'1-02-15'!$Q22","v":0},{"$f":"'8-02-15'!$Q22","v":0},{"$f":"'1-03-15'!$Q22","v":0},{"$f":"'8-03-15'!$Q22","v":0},{"$f":"'15-03-15'!$Q22","v":0},{"$f":"'22-03-15'!$Q22","v":0},{"$f":"'11-03-12'!$Q22","v":0},{"$f":"'18-03-12'!$Q22","v":0},{"$f":"'25-03-12'!$Q40","v":0},14,8,null,null,null,null,null,null,null,null,null,{"$f":"AI42+AJ42","v":0}]
[9,"PURE BLONDE",{"$f":"'12-10-14'!Q23","v":18},{"$f":"'19-10-14'!Q23","v":18},{"$f":"'26-10-14'!$Q23","v":0},{"$f":"'2-11-14'!$Q23","v":0},{"$f":"'9-11-14'!$Q23","v":0},{"$f":"'16-11-14'!$Q23","v":0},{"$f":"'23-11-14'!$Q23","v":0},{"$f":"'30-11-14'!$Q23","v":0},{"$f":"'7-12-14'!$Q23","v":0},{"$f":"'14-12-14'!$Q23","v":0},{"$f":"'11-01-15'!$Q23","v":0},{"$f":"'18-01-15'!$Q23","v":0},{"$f":"'25-01-15'!$Q23","v":0},{"$f":"'26-01-15'!$Q23","v":0},{"$f":"'1-02-15'!$Q23","v":0},{"$f":"'8-02-15'!$Q23","v":0},{"$f":"'1-03-15'!$Q23","v":0},{"$f":"'8-03-15'!$Q23","v":0},{"$f":"'15-03-15'!$Q23","v":0},{"$f":"'22-03-15'!$Q23","v":0},{"$f":"'11-03-12'!$Q23","v":0},{"$f":"'18-03-12'!$Q23","v":0},{"$f":"'25-03-12'!$Q41","v":0},36,9]
[10,"FISHER & PAYKEL",{"$f":"'12-10-14'!Q24","v":12},{"$f":"'19-10-14'!Q24","v":12},{"$f":"'26-10-14'!$Q24","v":0},{"$f":"'2-11-14'!$Q24","v":0},{"$f":"'9-11-14'!$Q24","v":0},{"$f":"'16-11-14'!$Q24","v":0},{"$f":"'23-11-14'!$Q24","v":0},{"$f":"'30-11-14'!$Q24","v":0},{"$f":"'7-12-14'!$Q24","v":0},{"$f":"'14-12-14'!$Q24","v":0},{"$f":"'11-01-15'!$Q24","v":0},{"$f":"'18-01-15'!$Q24","v":0},{"$f":"'25-01-15'!$Q24","v":0},{"$f":"'26-01-15'!$Q24","v":0},{"$f":"'1-02-15'!$Q24","v":0},{"$f":"'8-02-15'!$Q24","v":0},{"$f":"'1-03-15'!$Q24","v":0},{"$f":"'8-03-15'!$Q24","v":0},{"$f":"'15-03-15'!$Q24","v":0},{"$f":"'22-03-15'!$Q24","v":0},{"$f":"'11-03-12'!$Q24","v":0},{"$f":"'18-03-12'!$Q24","v":0},{"$f":"'25-03-12'!$Q42","v":0},24,10]
[11,"RED CLAW",{"$f":"'12-10-14'!Q25","v":9},{"$f":"'19-10-14'!Q25","v":5},{"$f":"'26-10-14'!$Q25","v":0},{"$f":"'2-11-14'!$Q25","v":0},{"$f":"'9-11-14'!$Q25","v":0},{"$f":"'16-11-14'!$Q25","v":0},{"$f":"'23-11-14'!$Q25","v":0},{"$f":"'30-11-14'!$Q25","v":0},{"$f":"'7-12-14'!$Q25","v":0},{"$f":"'14-12-14'!$Q25","v":0},{"$f":"'11-01-15'!$Q25","v":0},{"$f":"'18-01-15'!$Q25","v":0},{"$f":"'25-01-15'!$Q25","v":0},{"$f":"'26-01-15'!$Q25","v":0},{"$f":"'1-02-15'!$Q25","v":0},{"$f":"'8-02-15'!$Q25","v":0},{"$f":"'1-03-15'!$Q25","v":0},{"$f":"'8-03-15'!$Q25","v":0},{"$f":"'15-03-15'!$Q25","v":0},{"$f":"'22-03-15'!$Q25","v":0},{"$f":"'11-03-12'!$Q25","v":0},{"$f":"'18-03-12'!$Q25","v":0},{"$f":"'25-03-12'!$Q43","v":0},14,11]
[12,"PANASONIC",{"$f":"'12-10-14'!Q26","v":4},{"$f":"'19-10-14'!Q26","v":18},{"$f":"'26-10-14'!$Q26","v":0},{"$f":"'2-11-14'!$Q26","v":0},{"$f":"'9-11-14'!$Q26","v":0},{"$f":"'16-11-14'!$Q26","v":0},{"$f":"'23-11-14'!$Q26","v":0},{"$f":"'30-11-14'!$Q26","v":0},{"$f":"'7-12-14'!$Q26","v":0},{"$f":"'14-12-14'!$Q26","v":0},{"$f":"'11-01-15'!$Q26","v":0},{"$f":"'18-01-15'!$Q26","v":0},{"$f":"'25-01-15'!$Q26","v":0},{"$f":"'26-01-15'!$Q26","v":0},{"$f":"'1-02-15'!$Q26","v":0},{"$f":"'8-02-15'!$Q26","v":0},{"$f":"'1-03-15'!$Q26","v":0},{"$f":"'8-03-15'!$Q26","v":0},{"$f":"'15-03-15'!$Q26","v":0},{"$f":"'22-03-15'!$Q26","v":0},{"$f":"'11-03-12'!$Q26","v":0},{"$f":"'18-03-12'!$Q26","v":0},{"$f":"'25-03-12'!$Q44","v":0},22,12]
[13,"KENWOOD-RABBITOHS",{"$f":"'12-10-14'!Q27","v":10},{"$f":"'19-10-14'!Q27","v":8},{"$f":"'26-10-14'!$Q27","v":0},{"$f":"'2-11-14'!$Q27","v":0},{"$f":"'9-11-14'!$Q27","v":0},{"$f":"'16-11-14'!$Q27","v":0},{"$f":"'23-11-14'!$Q27","v":0},{"$f":"'30-11-14'!$Q27","v":0},{"$f":"'7-12-14'!$Q27","v":0},{"$f":"'14-12-14'!$Q27","v":0},{"$f":"'11-01-15'!$Q27","v":0},{"$f":"'18-01-15'!$Q27","v":0},{"$f":"'25-01-15'!$Q27","v":0},{"$f":"'26-01-15'!$Q27","v":0},{"$f":"'1-02-15'!$Q27","v":0},{"$f":"'8-02-15'!$Q27","v":0},{"$f":"'1-03-15'!$Q27","v":0},{"$f":"'8-03-15'!$Q27","v":0},{"$f":"'15-03-15'!$Q27","v":0},{"$f":"'22-03-15'!$Q27","v":0},{"$f":"'11-03-12'!$Q27","v":0},{"$f":"'18-03-12'!$Q27","v":0},{"$f":"'25-03-12'!$Q45","v":0},18,13]
[14,"TF COLLECT",{"$f":"'12-10-14'!Q28","v":18},{"$f":"'19-10-14'!Q28","v":18},{"$f":"'26-10-14'!$Q28","v":0},{"$f":"'2-11-14'!$Q28","v":0},{"$f":"'9-11-14'!$Q28","v":0},{"$f":"'16-11-14'!$Q28","v":0},{"$f":"'23-11-14'!$Q28","v":0},{"$f":"'30-11-14'!$Q28","v":0},{"$f":"'7-12-14'!$Q28","v":0},{"$f":"'14-12-14'!$Q28","v":0},{"$f":"'11-01-15'!$Q28","v":0},{"$f":"'18-01-15'!$Q28","v":0},{"$f":"'25-01-15'!$Q28","v":0},{"$f":"'26-01-15'!$Q28","v":0},{"$f":"'1-02-15'!$Q28","v":0},{"$f":"'8-02-15'!$Q28","v":0},{"$f":"'1-03-15'!$Q28","v":0},{"$f":"'8-03-15'!$Q28","v":0},{"$f":"'15-03-15'!$Q28","v":0},{"$f":"'22-03-15'!$Q28","v":0},{"$f":"'11-03-12'!$Q28","v":0},{"$f":"'18-03-12'!$Q28","v":0},{"$f":"'25-03-12'!$Q46","v":0},36,14]
[15,"THE KITCHEN MAKER",{"$f":"'12-10-14'!Q29","v":11},{"$f":"'19-10-14'!Q29","v":18},{"$f":"'26-10-14'!$Q29","v":0},{"$f":"'2-11-14'!$Q29","v":0},{"$f":"'9-11-14'!$Q29","v":0},{"$f":"'16-11-14'!$Q29","v":0},{"$f":"'23-11-14'!$Q29","v":0},{"$f":"'30-11-14'!$Q29","v":0},{"$f":"'7-12-14'!$Q29","v":0},{"$f":"'14-12-14'!$Q29","v":0},{"$f":"'11-01-15'!$Q29","v":0},{"$f":"'18-01-15'!$Q29","v":0},{"$f":"'25-01-15'!$Q29","v":0},{"$f":"'26-01-15'!$Q29","v":0},{"$f":"'1-02-15'!$Q29","v":0},{"$f":"'8-02-15'!$Q29","v":0},{"$f":"'1-03-15'!$Q29","v":0},{"$f":"'8-03-15'!$Q29","v":0},{"$f":"'15-03-15'!$Q29","v":0},{"$f":"'22-03-15'!$Q29","v":0},{"$f":"'11-03-12'!$Q29","v":0},{"$f":"'18-03-12'!$Q29","v":0},{"$f":"'25-03-12'!$Q47","v":0},29,15]
[16,"PROJECT RACING",{"$f":"'12-10-14'!Q30","v":18},{"$f":"'19-10-14'!Q30","v":11},{"$f":"'26-10-14'!$Q30","v":0},{"$f":"'2-11-14'!$Q30","v":0},{"$f":"'9-11-14'!$Q30","v":0},{"$f":"'16-11-14'!$Q30","v":0},{"$f":"'23-11-14'!$Q30","v":0},{"$f":"'30-11-14'!$Q30","v":0},{"$f":"'7-12-14'!$Q30","v":0},{"$f":"'14-12-14'!$Q30","v":0},{"$f":"'11-01-15'!$Q30","v":0},{"$f":"'18-01-15'!$Q30","v":0},{"$f":"'25-01-15'!$Q30","v":0},{"$f":"'26-01-15'!$Q30","v":0},{"$f":"'1-02-15'!$Q30","v":0},{"$f":"'8-02-15'!$Q30","v":0},{"$f":"'1-03-15'!$Q30","v":0},{"$f":"'8-03-15'!$Q30","v":0},{"$f":"'15-03-15'!$Q30","v":0},{"$f":"'22-03-15'!$Q30","v":0},{"$f":"'11-03-12'!$Q30","v":0},{"$f":"'18-03-12'!$Q30","v":0},{"$f":"'25-03-12'!$Q48","v":0},29,16]
[17,"TEAM PARKINSON",{"$f":"'12-10-14'!Q31","v":13},{"$f":"'19-10-14'!Q31","v":18},{"$f":"'26-10-14'!$Q31","v":0},{"$f":"'2-11-14'!$Q31","v":0},{"$f":"'9-11-14'!$Q31","v":0},{"$f":"'16-11-14'!$Q31","v":0},{"$f":"'23-11-14'!$Q31","v":0},{"$f":"'30-11-14'!$Q31","v":0},{"$f":"'7-12-14'!$Q31","v":0},{"$f":"'14-12-14'!$Q31","v":0},{"$f":"'11-01-15'!$Q31","v":0},{"$f":"'18-01-15'!$Q31","v":0},{"$f":"'25-01-15'!$Q31","v":0},{"$f":"'26-01-15'!$Q31","v":0},{"$f":"'1-02-15'!$Q31","v":0},{"$f":"'8-02-15'!$Q31","v":0},{"$f":"'1-03-15'!$Q31","v":0},{"$f":"'8-03-15'!$Q31","v":0},{"$f":"'15-03-15'!$Q31","v":0},{"$f":"'22-03-15'!$Q31","v":0},{"$f":"'11-03-12'!$Q31","v":0},{"$f":"'18-03-12'!$Q31","v":0},{"$f":"'25-03-12'!$Q49","v":0},31,17]
[18,null,{"$f":"'12-10-14'!Q32","v":18},{"$f":"'19-10-14'!Q32","v":18},{"$f":"'26-10-14'!$Q32","v":0},{"$f":"'2-11-14'!$Q32","v":0},{"$f":"'9-11-14'!$Q32","v":0},{"$f":"'16-11-14'!$Q32","v":0},{"$f":"'23-11-14'!$Q33","v":0},{"$f":"'30-11-14'!$Q33","v":0},{"$f":"'7-12-14'!$Q33","v":0},{"$f":"'14-12-14'!$Q33","v":0},{"$f":"'11-01-15'!$Q33","v":0},{"$f":"'18-01-15'!$Q33","v":0},{"$f":"'25-01-15'!$Q33","v":0},{"$f":"'26-01-15'!$Q33","v":0},{"$f":"'1-02-15'!$Q33","v":0},{"$f":"'8-02-15'!$Q33","v":0},{"$f":"'1-03-15'!$Q33","v":0},{"$f":"'8-03-15'!$Q33","v":0},{"$f":"'15-03-15'!$Q33","v":0},{"$f":"'22-03-15'!$Q33","v":0},{"$f":"'11-03-12'!$Q33","v":0},{"$f":"'18-03-12'!$Q33","v":0},{"$f":"'25-03-12'!$Q23","v":0},null,18]
[19,null,{"$f":"'12-10-14'!Q33","v":18},{"$f":"'19-10-14'!Q33","v":18},{"$f":"'26-10-14'!$Q33","v":0},{"$f":"'2-11-14'!$Q33","v":0},{"$f":"'9-11-14'!$Q33","v":0},{"$f":"'16-11-14'!$Q33","v":0},{"$f":"'23-11-14'!$Q34","v":0},{"$f":"'30-11-14'!$Q34","v":0},{"$f":"'7-12-14'!$Q34","v":0},{"$f":"'14-12-14'!$Q34","v":0},{"$f":"'11-01-15'!$Q34","v":0},{"$f":"'18-01-15'!$Q34","v":0},{"$f":"'25-01-15'!$Q34","v":0},{"$f":"'26-01-15'!$Q34","v":0},{"$f":"'1-02-15'!$Q34","v":0},{"$f":"'8-02-15'!$Q34","v":0},{"$f":"'1-03-15'!$Q34","v":0},{"$f":"'8-03-15'!$Q34","v":0},{"$f":"'15-03-15'!$Q34","v":0},{"$f":"'22-03-15'!$Q34","v":0},{"$f":"'11-03-12'!$Q34","v":0},{"$f":"'18-03-12'!$Q34","v":0},{"$f":"'25-03-12'!$Q26","v":0},null,19,null,null,null,null,null,null,null,"NB These cells have white forground to hide data"]
[20,null,{"$f":"'12-10-14'!Q34","v":18},{"$f":"'19-10-14'!Q34","v":18},{"$f":"'26-10-14'!$Q34","v":0},{"$f":"'2-11-14'!$Q34","v":0},{"$f":"'9-11-14'!$Q34","v":0},{"$f":"'16-11-14'!$Q34","v":0},{"$f":"'23-11-14'!$Q35","v":0},{"$f":"'30-11-14'!$Q35","v":0},{"$f":"'7-12-14'!$Q35","v":0},{"$f":"'14-12-14'!$Q35","v":0},{"$f":"'11-01-15'!$Q35","v":0},{"$f":"'18-01-15'!$Q35","v":0},{"$f":"'25-01-15'!$Q35","v":0},{"$f":"'26-01-15'!$Q35","v":0},{"$f":"'1-02-15'!$Q35","v":0},{"$f":"'8-02-15'!$Q35","v":0},{"$f":"'1-03-15'!$Q35","v":0},{"$f":"'8-03-15'!$Q35","v":0},{"$f":"'15-03-15'!$Q35","v":0},{"$f":"'22-03-15'!$Q35","v":0},{"$f":"'11-03-12'!$Q35","v":0},{"$f":"'18-03-12'!$Q35","v":0},{"$f":"'25-03-12'!$Q30","v":0},null,20]
[22,null,{"$f":"'12-10-14'!Q36","v":18},{"$f":"'19-10-14'!Q36","v":18},{"$f":"'26-10-14'!$Q36","v":0},{"$f":"'2-11-14'!$Q36","v":0},{"$f":"'9-11-14'!$Q36","v":0},{"$f":"'16-11-14'!$Q36","v":0},{"$f":"'23-11-14'!$Q37","v":0},{"$f":"'30-11-14'!$Q37","v":0},{"$f":"'7-12-14'!$Q37","v":0},{"$f":"'14-12-14'!$Q37","v":0},{"$f":"'11-01-15'!$Q37","v":0},{"$f":"'18-01-15'!$Q37","v":0},{"$f":"'25-01-15'!$Q37","v":0},{"$f":"'26-01-15'!$Q37","v":0},{"$f":"'1-02-15'!$Q37","v":0},{"$f":"'8-02-15'!$Q37","v":0},{"$f":"'1-03-15'!$Q37","v":0},{"$f":"'8-03-15'!$Q37","v":0},{"$f":"'15-03-15'!$Q37","v":0},{"$f":"'22-03-15'!$Q37","v":0},{"$f":"'11-03-12'!$Q37","v":0},{"$f":"'18-03-12'!$Q37","v":0},{"$f":"'25-03-12'!$Q28","v":0},null,21]
[23,null,{"$f":"'12-10-14'!Q35","v":18},{"$f":"'19-10-14'!Q35","v":18},{"$f":"'26-10-14'!$Q35","v":0},{"$f":"'2-11-14'!$Q35","v":0},{"$f":"'9-11-14'!$Q35","v":0},{"$f":"'16-11-14'!$Q35","v":0},{"$f":"'23-11-14'!$Q36","v":0},{"$f":"'30-11-14'!$Q36","v":0},{"$f":"'7-12-14'!$Q36","v":0},{"$f":"'14-12-14'!$Q36","v":0},{"$f":"'11-01-15'!$Q36","v":0},{"$f":"'18-01-15'!$Q36","v":0},{"$f":"'25-01-15'!$Q36","v":0},{"$f":"'26-01-15'!$Q36","v":0},{"$f":"'1-02-15'!$Q36","v":0},{"$f":"'8-02-15'!$Q36","v":0},{"$f":"'1-03-15'!$Q36","v":0},{"$f":"'8-03-15'!$Q36","v":0},{"$f":"'15-03-15'!$Q36","v":0},{"$f":"'22-03-15'!$Q36","v":0},{"$f":"'11-03-12'!$Q36","v":0},{"$f":"'18-03-12'!$Q36","v":0},{"$f":"'25-03-12'!$Q37","v":0},null,22]
[null,null,null,null,null,null,{"$f":"'9-11-14'!$Q32","v":0},{"$f":"'16-11-14'!$Q32","v":0},{"$f":"'23-11-14'!$Q32","v":0},{"$f":"'30-11-14'!$Q32","v":0},{"$f":"'7-12-14'!$Q32","v":0},{"$f":"'14-12-14'!$Q32","v":0},{"$f":"'11-01-15'!$Q32","v":0},{"$f":"'18-01-15'!$Q32","v":0},{"$f":"'25-01-15'!$Q32","v":0},{"$f":"'26-01-15'!$Q32","v":0},{"$f":"'1-02-15'!$Q32","v":0},{"$f":"'8-02-15'!$Q32","v":0},{"$f":"'1-03-15'!$Q32","v":0},{"$f":"'8-03-15'!$Q32","v":0},{"$f":"'15-03-15'!$Q32","v":0},{"$f":"'22-03-15'!$Q32","v":0},{"$f":"'11-03-12'!$Q32","v":0},{"$f":"'18-03-12'!$Q32","v":0},{"$f":"'25-03-12'!$Q38","v":0},null,23]
["Notes:"]
[]
[]
["AUSTRALIAN 18Ft League - 2011/12 NSW Championship Pointscore"]
[null,"Best 4 results will count.",{"$f":"'9-11-14'!$G4","v":"2014-11-09"},{"$f":"'16-11-14'!$G4","v":"2014-11-16"},{"$f":"'23-11-14'!$G4","v":"2014-11-23"},{"$f":"'30-11-14'!$G4","v":"2014-11-30"},{"$f":"'7-12-14'!$G4","v":"2014-12-07"},1,"Drop"]
["Recall #","Name","R1","R2","R3","R4","R5","Total","Total","POS"]
[1,"THURLOW FISHER LAWYERS",{"$f":"'9-11-14'!$P15","v":0},{"$f":"'16-11-14'!$P15","v":0},{"$f":"'23-11-14'!$P15","v":0},{"$f":"'30-11-14'!$P15","v":0},{"$f":"'7-12-14'!$P15","v":0},{"$f":"SUM(C64:G64)","v":0},{"$f":"IF(H$62=1,SUM(C64:G64)-MAX(C64:G64),SUM(C64:G64))","v":0},1]
[2,"YANDOO",{"$f":"'9-11-14'!$P16","v":0},{"$f":"'16-11-14'!$P16","v":0},{"$f":"'23-11-14'!$P16","v":0},{"$f":"'30-11-14'!$P16","v":0},{"$f":"'7-12-14'!$P16","v":0},0,0,2]
[3,"ASKO APPLIANCES",{"$f":"'9-11-14'!$P17","v":0},{"$f":"'16-11-14'!$P17","v":0},{"$f":"'23-11-14'!$P17","v":0},{"$f":"'30-11-14'!$P17","v":0},{"$f":"'7-12-14'!$P17","v":0},0,0,3]
[4,"DE'LONGHI",{"$f":"'9-11-14'!$P18","v":0},{"$f":"'16-11-14'!$P18","v":0},{"$f":"'23-11-14'!$P18","v":0},{"$f":"'30-11-14'!$P18","v":0},{"$f":"'7-12-14'!$P18","v":0},0,0,4]
[5,"APPLIANCESONLINE.COM.AU",{"$f":"'9-11-14'!$P19","v":0},{"$f":"'16-11-14'!$P19","v":0},{"$f":"'23-11-14'!$P19","v":0},{"$f":"'30-11-14'!$P19","v":0},{"$f":"'7-12-14'!$P19","v":0},0,0,5]
[6,"RAG & FAMISH HOTEL",{"$f":"'9-11-14'!$P20","v":0},{"$f":"'16-11-14'!$P20","v":0},{"$f":"'23-11-14'!$P20","v":0},{"$f":"'30-11-14'!$P20","v":0},{"$f":"'7-12-14'!$P20","v":0},0,0,6]
[7,"GOTTA LOVE IT 7",{"$f":"'9-11-14'!$P21","v":0},{"$f":"'16-11-14'!$P21","v":0},{"$f":"'23-11-14'!$P21","v":0},{"$f":"'30-11-14'!$P21","v":0},{"$f":"'7-12-14'!$P21","v":0},0,0,7]
[8,"SMEG",{"$f":"'9-11-14'!$P22","v":0},{"$f":"'16-11-14'!$P22","v":0},{"$f":"'23-11-14'!$P22","v":0},{"$f":"'30-11-14'!$P22","v":0},{"$f":"'7-12-14'!$P22","v":0},0,0,8]
[9,"PURE BLONDE",{"$f":"'9-11-14'!$P23","v":0},{"$f":"'16-11-14'!$P23","v":0},{"$f":"'23-11-14'!$P23","v":0},{"$f":"'30-11-14'!$P23","v":0},{"$f":"'7-12-14'!$P23","v":0},0,0,9]
[10,"FISHER & PAYKEL",{"$f":"'9-11-14'!$P24","v":0},{"$f":"'16-11-14'!$P24","v":0},{"$f":"'23-11-14'!$P24","v":0},{"$f":"'30-11-14'!$P24","v":0},{"$f":"'7-12-14'!$P24","v":0},0,0,10]
[11,"RED CLAW",{"$f":"'9-11-14'!$P25","v":0},{"$f":"'16-11-14'!$P25","v":0},{"$f":"'23-11-14'!$P25","v":0},{"$f":"'30-11-14'!$P25","v":0},{"$f":"'7-12-14'!$P25","v":0},0,0,11]
[12,"PANASONIC",{"$f":"'9-11-14'!$P26","v":0},{"$f":"'16-11-14'!$P26","v":0},{"$f":"'23-11-14'!$P26","v":0},{"$f":"'30-11-14'!$P26","v":0},{"$f":"'7-12-14'!$P26","v":0},0,0,12]
[13,"KENWOOD",{"$f":"'9-11-14'!$P27","v":0},{"$f":"'16-11-14'!$P27","v":0},{"$f":"'23-11-14'!$P27","v":0},{"$f":"'30-11-14'!$P27","v":0},{"$f":"'7-12-14'!$P27","v":0},0,0,13]
[14,"TF COLLECT",{"$f":"'9-11-14'!$P28","v":0},{"$f":"'16-11-14'!$P28","v":0},{"$f":"'23-11-14'!$P28","v":0},{"$f":"'30-11-14'!$P28","v":0},{"$f":"'7-12-14'!$P28","v":0},0,0,14]
[15,"THE KITCHEN MAKER",{"$f":"'9-11-14'!$P29","v":0},{"$f":"'16-11-14'!$P29","v":0},{"$f":"'23-11-14'!$P29","v":0},{"$f":"'30-11-14'!$P29","v":0},{"$f":"'7-12-14'!$P29","v":0},0,0,15]
[16,"PROJECT RACING",{"$f":"'9-11-14'!$P30","v":0},{"$f":"'16-11-14'!$P30","v":0},{"$f":"'23-11-14'!$P30","v":0},{"$f":"'30-11-14'!$P30","v":0},{"$f":"'7-12-14'!$P30","v":0},0,0,16]
[17,"TEAM PARKINSON",{"$f":"'9-11-14'!$P31","v":0},{"$f":"'16-11-14'!$P31","v":0},{"$f":"'23-11-14'!$P31","v":0},{"$f":"'30-11-14'!$P31","v":0},{"$f":"'7-12-14'!$P31","v":0},0,0,17]
[18,null,{"$f":"'9-11-14'!$P32","v":0},{"$f":"'16-11-14'!$P32","v":0},{"$f":"'23-11-14'!$P32","v":0},{"$f":"'30-11-14'!$P32","v":0},{"$f":"'7-12-14'!$P32","v":0},0,0,18]
[19,null,{"$f":"'9-11-14'!$P33","v":0},{"$f":"'16-11-14'!$P33","v":0},{"$f":"'23-11-14'!$P33","v":0},{"$f":"'30-11-14'!$P33","v":0},{"$f":"'7-12-14'!$P33","v":0},0,0,19]
[20,null,{"$f":"'9-11-14'!$P34","v":0},{"$f":"'16-11-14'!$P34","v":0},{"$f":"'23-11-14'!$P34","v":0},{"$f":"'30-11-14'!$P34","v":0},{"$f":"'7-12-14'!$P34","v":0},0,0,20]
[21,null,{"$f":"'9-11-14'!$P35","v":0},{"$f":"'16-11-14'!$P35","v":0},{"$f":"'23-11-14'!$P35","v":0},{"$f":"'30-11-14'!$P35","v":0},{"$f":"'7-12-14'!$P35","v":0},0,0,21]
[22,null,{"$f":"'9-11-14'!$P36","v":0},{"$f":"'16-11-14'!$P36","v":0},{"$f":"'23-11-14'!$P36","v":0},{"$f":"'30-11-14'!$P36","v":0},{"$f":"'7-12-14'!$P36","v":0},0,0,22]
[23,null,{"$f":"'9-11-14'!$P37","v":0},{"$f":"'16-11-14'!$P37","v":0},{"$f":"'23-11-14'!$P37","v":0},{"$f":"'30-11-14'!$P37","v":0},{"$f":"'7-12-14'!$P37","v":0},0,0,23]
[null,null,null,null,null,null,null,0,0]
["NOTE:"]
[]
[]
[null,null,null,null,null,null,null,null,null,null,null,null,null,null,null,null,null,null,null,null,null,null,null,null,null,null,"S"]
["Australian 18ft Skiff Championship Pointscore"]
[null,"Best 4 results will count.",{"$f":"'11-01-15'!$G4","v":"2015-01-11"},{"$f":"'18-01-15'!$G4","v":"2015-01-18"},{"$f":"'25-01-15'!$G4","v":"2015-01-25"},{"$f":"'26-01-15'!$G4","v":"2015-01-26"},{"$f":"'1-02-15'!$G4","v":"2015-02-01"},null,1,"DROP"]
["Recall","Name","R1","R2","R3","R4","R5"," ","Total","Total","POS"]
[1,"THURLOW FISHER LAWYERS",{"$f":"'11-01-15'!$P15","v":0},{"$f":"'18-01-15'!$P15","v":0},{"$f":"'25-01-15'!$P15","v":0},{"$f":"'26-01-15'!$P15","v":0},{"$f":"'1-02-15'!$P15","v":0},null,{"$f":"SUM(C95:H95)","v":0},{"$f":"IF(I$93=1,SUM(C95:H95)-MAX(C95:H95),SUM(C95:H95))","v":0},1]
[2,"YANDOO",{"$f":"'11-01-15'!$P16","v":0},{"$f":"'18-01-15'!$P16","v":0},{"$f":"'25-01-15'!$P16","v":0},{"$f":"'26-01-15'!$P16","v":0},{"$f":"'1-02-15'!$P16","v":0},null,0,0,2]
[3,"ASKO APPLIANCES",{"$f":"'11-01-15'!$P17","v":0},{"$f":"'18-01-15'!$P17","v":0},{"$f":"'25-01-15'!$P17","v":0},6.1,{"$f":"'1-02-15'!$P17","v":0},null,6.1,0,3]
[4,"DE'LONGHI-RABBITOHS",{"$f":"'11-01-15'!$P18","v":0},{"$f":"'18-01-15'!$P18","v":0},{"$f":"'25-01-15'!$P18","v":0},{"$f":"'26-01-15'!$P18","v":0},{"$f":"'1-02-15'!$P18","v":0},null,0,0,4]
[5,"APPLIANCESONLINE.COM.AU",{"$f":"'11-01-15'!$P19","v":0},{"$f":"'18-01-15'!$P19","v":0},{"$f":"'25-01-15'!$P19","v":0},{"$f":"'26-01-15'!$P19","v":0},{"$f":"'1-02-15'!$P19","v":0},null,0,0,5]
[6,"RAG & FAMISH HOTEL",{"$f":"'11-01-15'!$P20","v":0},{"$f":"'18-01-15'!$P20","v":0},{"$f":"'25-01-15'!$P20","v":0},{"$f":"'26-01-15'!$P20","v":0},{"$f":"'1-02-15'!$P20","v":0},null,0,0,6]
[7,"GOTTA LOVE IT 7",{"$f":"'11-01-15'!$P21","v":0},{"$f":"'18-01-15'!$P21","v":0},{"$f":"'25-01-15'!$P21","v":0},{"$f":"'26-01-15'!$P21","v":0},{"$f":"'1-02-15'!$P21","v":0},null,0,0,7]
[8,"SMEG",{"$f":"'11-01-15'!$P22","v":0},{"$f":"'18-01-15'!$P22","v":0},{"$f":"'25-01-15'!$P22","v":0},{"$f":"'26-01-15'!$P22","v":0},{"$f":"'1-02-15'!$P22","v":0},null,0,0,8]
[9,"PURE BLONDE",{"$f":"'11-01-15'!$P23","v":0},{"$f":"'18-01-15'!$P23","v":0},{"$f":"'25-01-15'!$P23","v":0},{"$f":"'26-01-15'!$P23","v":0},{"$f":"'1-02-15'!$P23","v":0},null,0,0,9]
[10,"FISHER & PAYKEL",{"$f":"'11-01-15'!$P24","v":0},{"$f":"'18-01-15'!$P24","v":0},{"$f":"'25-01-15'!$P24","v":0},{"$f":"'26-01-15'!$P24","v":0},{"$f":"'1-02-15'!$P24","v":0},null,0,0,10]
[11,"RED CLAW",{"$f":"'11-01-15'!$P25","v":0},{"$f":"'18-01-15'!$P25","v":0},{"$f":"'25-01-15'!$P25","v":0},5.0999999999999996,{"$f":"'1-02-15'!$P25","v":0},null,5.0999999999999996,0,11]
[12,"PANASONIC",{"$f":"'11-01-15'!$P26","v":0},{"$f":"'18-01-15'!$P26","v":0},{"$f":"'25-01-15'!$P26","v":0},{"$f":"'26-01-15'!$P26","v":0},{"$f":"'1-02-15'!$P26","v":0},null,0,0,12]
[13,"KENWOOD-RABBITOHS",{"$f":"'11-01-15'!$P27","v":0},{"$f":"'18-01-15'!$P27","v":0},{"$f":"'25-01-15'!$P27","v":0},{"$f":"'26-01-15'!$P27","v":0},{"$f":"'1-02-15'!$P27","v":0},null,0,0,13]
[14,"TF COLLECT",{"$f":"'11-01-15'!$P28","v":0},{"$f":"'18-01-15'!$P28","v":0},{"$f":"'25-01-15'!$P28","v":0},12.1,{"$f":"'1-02-15'!$P28","v":0},null,12.1,0,14]
[15,"THE KITCHEN MAKER",{"$f":"'11-01-15'!$P29","v":0},{"$f":"'18-01-15'!$P29","v":0},{"$f":"'25-01-15'!$P29","v":0},{"$f":"'26-01-15'!$P29","v":0},{"$f":"'1-02-15'!$P29","v":0},null,0,0,15]
[16,"PROJECT RACING",{"$f":"'11-01-15'!$P30","v":0},{"$f":"'18-01-15'!$P30","v":0},{"$f":"'25-01-15'!$P30","v":0},{"$f":"'26-01-15'!$P30","v":0},{"$f":"'1-02-15'!$P30","v":0},null,0,0,16]
[17,"TEAM PARKINSON",{"$f":"'11-01-15'!$P31","v":0},{"$f":"'18-01-15'!$P31","v":0},{"$f":"'25-01-15'!$P31","v":0},{"$f":"'26-01-15'!$P31","v":0},{"$f":"'1-02-15'!$P31","v":0},null,0,0,17]
[18,"COLDWELL BANKER-SHARKS",{"$f":"'11-01-15'!$P32","v":0},{"$f":"'18-01-15'!$P32","v":0},{"$f":"'25-01-15'!$P32","v":0},{"$f":"'26-01-15'!$P32","v":0},{"$f":"'1-02-15'!$P32","v":0},null,0,0,18]
[19,"SLAM",{"$f":"'11-01-15'!$P33","v":0},{"$f":"'18-01-15'!$P33","v":0},{"$f":"'25-01-15'!$P33","v":0},{"$f":"'26-01-15'!$P33","v":0},{"$f":"'1-02-15'!$P33","v":0},null,0,0,19]
[20,null,{"$f":"'11-01-15'!$P34","v":0},{"$f":"'18-01-15'!$P34","v":0},{"$f":"'25-01-15'!$P34","v":0},{"$f":"'26-01-15'!$P34","v":0},{"$f":"'1-02-15'!$P34","v":0},null,0,0,20]
[21,null,{"$f":"'11-01-15'!$P35","v":0},{"$f":"'18-01-15'!$P35","v":0},{"$f":"'25-01-15'!$P35","v":0},{"$f":"'26-01-15'!$P35","v":0},{"$f":"'1-02-15'!$P35","v":0},null,0,0,21]
[22,null,{"$f":"'11-01-15'!$P36","v":0},{"$f":"'18-01-15'!$P36","v":0},{"$f":"'25-01-15'!$P36","v":0},{"$f":"'26-01-15'!$P36","v":0},{"$f":"'1-02-15'!$P36","v":0},null,0,0,22]
[23,null,{"$f":"'11-01-15'!$P37","v":0},{"$f":"'18-01-15'!$P37","v":0},{"$f":"'25-01-15'!$P37","v":0},{"$f":"'26-01-15'!$P37","v":0},{"$f":"'1-02-15'!$P37","v":0},null,0,0,23]
[24,null,{"$f":"'11-01-15'!$P38","v":0},{"$f":"'18-01-15'!$P38","v":0},{"$f":"'25-01-15'!$P38","v":0},{"$f":"'26-01-15'!$P38","v":0},{"$f":"'1-02-15'!$P38","v":0},null,0,0,24]
[]
[]
["AUSTRALIAN 18Ft League - 2010/11 J. J. Giltinan Selection Point Score"]
[null,"Best 9 results will count.",{"$f":"'9-11-14'!G4","v":"2014-11-09"},{"$f":"'16-11-14'!G4","v":"2014-11-16"},{"$f":"'14-12-14'!G4","v":"2014-12-14"},{"$f":"'30-11-14'!G4","v":"2014-11-30"},{"$f":"'7-12-14'!G4","v":"2014-12-07"},{"$f":"'11-01-15'!G4","v":"2015-01-11"},{"$f":"'18-01-15'!G4","v":"2015-01-18"},{"$f":"'25-01-15'!G4","v":"2015-01-25"},{"$f":"'26-01-15'!G4","v":"2015-01-26"},{"$f":"'1-02-15'!G4","v":"2015-02-01"},null,null,0,"DROPS"]
["Recall","Name","R1","R2","R3","R4","R5","R6","R7","R8","R9","R10",null," ","Total","Total","POS",null,null,null,null,null,null,null,null,null,null,null,null,null,"Drop1","Drop2"]
[1,"THURLOW FISHER LAWYERS",{"$f":"'2-11-14'!$P15","v":0},{"$f":"'9-11-14'!$P15","v":0},{"$f":"'16-11-14'!$P15","v":0},{"$f":"'14-12-14'!$P15","v":0},{"$f":"'30-11-14'!$P15","v":0},{"$f":"'7-12-14'!$P15","v":0},{"$f":"'11-01-15'!$P15","v":0},{"$f":"'18-01-15'!$P15","v":0},{"$f":"'25-01-15'!$P15","v":0},{"$f":"'26-01-15'!$P15","v":0},null,null,{"$f":"SUM(C124:N124)","v":0},{"$f":"IF(O$122=0,O124,O124-AE123-AF123)","v":0},1,null,null,null,null,null,null,null,null,null,null,null,null,null,{"$f":"MAX(C125:N125)","v":0},{"$f":"LARGE(C125:N125,2)","v":0}]
[2,"YANDOO",{"$f":"'2-11-14'!$P16","v":0},{"$f":"'9-11-14'!$P16","v":0},{"$f":"'16-11-14'!$P16","v":0},{"$f":"'14-12-14'!$P16","v":0},{"$f":"'30-11-14'!$P16","v":0},{"$f":"'7-12-14'!$P16","v":0},{"$f":"'11-01-15'!$P16","v":0},{"$f":"'18-01-15'!$P16","v":0},{"$f":"'25-01-15'!$P16","v":0},{"$f":"'26-01-15'!$P16","v":0},null,null,0,0,2,null,null,null,null,null,null,null,null,null,null,null,null,null,0,0]
[3,"ASKO APPLIANCES",{"$f":"'2-11-14'!$P17","v":0},{"$f":"'9-11-14'!$P17","v":0},{"$f":"'16-11-14'!$P17","v":0},{"$f":"'14-12-14'!$P17","v":0},{"$f":"'30-11-14'!$P17","v":0},{"$f":"'7-12-14'!$P17","v":0},{"$f":"'11-01-15'!$P17","v":0},{"$f":"'18-01-15'!$P17","v":0},{"$f":"'25-01-15'!$P17","v":0},{"$f":"'26-01-15'!$P17","v":0},null,null,0,0,3,null,null,null,null,null,null,null,null,null,null,null,null,null,0,0]
[4,"DE'LONGHI",{"$f":"'2-11-14'!$P18","v":0},{"$f":"'9-11-14'!$P18","v":0},{"$f":"'16-11-14'!$P18","v":0},{"$f":"'14-12-14'!$P18","v":0},{"$f":"'30-11-14'!$P18","v":0},{"$f":"'7-12-14'!$P18","v":0},{"$f":"'11-01-15'!$P18","v":0},{"$f":"'18-01-15'!$P18","v":0},{"$f":"'25-01-15'!$P18","v":0},{"$f":"'26-01-15'!$P18","v":0},null,null,0,0,4,null,null,null,null,null,null,null,null,null,null,null,null,null,0,0]
[5,"APPLIANCESONLINE.COM.AU",{"$f":"'2-11-14'!$P19","v":0},{"$f":"'9-11-14'!$P19","v":0},{"$f":"'16-11-14'!$P19","v":0},{"$f":"'14-12-14'!$P19","v":0},{"$f":"'30-11-14'!$P19","v":0},{"$f":"'7-12-14'!$P19","v":0},{"$f":"'11-01-15'!$P19","v":0},{"$f":"'18-01-15'!$P19","v":0},{"$f":"'25-01-15'!$P19","v":0},{"$f":"'26-01-15'!$P19","v":0},null,null,0,0,5,null,null,null,null,null,null,null,null,null,null,null,null,null,0,0]
[6,"RAG & FAMISH HOTEL",{"$f":"'2-11-14'!$P20","v":0},{"$f":"'9-11-14'!$P20","v":0},{"$f":"'16-11-14'!$P20","v":0},{"$f":"'14-12-14'!$P20","v":0},{"$f":"'30-11-14'!$P20","v":0},{"$f":"'7-12-14'!$P20","v":0},{"$f":"'11-01-15'!$P20","v":0},{"$f":"'18-01-15'!$P20","v":0},{"$f":"'25-01-15'!$P20","v":0},{"$f":"'26-01-15'!$P20","v":0},null,null,0,0,6,null,null,null,null,null,null,null,null,null,null,null,null,null,0,0]
[7,"GOTTA LOVE IT 7",{"$f":"'2-11-14'!$P21","v":0},{"$f":"'9-11-14'!$P21","v":0},{"$f":"'16-11-14'!$P21","v":0},{"$f":"'14-12-14'!$P21","v":0},{"$f":"'30-11-14'!$P21","v":0},{"$f":"'7-12-14'!$P21","v":0},{"$f":"'11-01-15'!$P21","v":0},{"$f":"'18-01-15'!$P21","v":0},{"$f":"'25-01-15'!$P21","v":0},{"$f":"'26-01-15'!$P21","v":0},null,null,0,0,7,null,null,null,null,null,null,null,null,null,null,null,null,null,0,0]
[8,"SMEG",{"$f":"'2-11-14'!$P22","v":0},{"$f":"'9-11-14'!$P22","v":0},{"$f":"'16-11-14'!$P22","v":0},{"$f":"'14-12-14'!$P22","v":0},{"$f":"'30-11-14'!$P22","v":0},{"$f":"'7-12-14'!$P22","v":0},{"$f":"'11-01-15'!$P22","v":0},{"$f":"'18-01-15'!$P22","v":0},{"$f":"'25-01-15'!$P22","v":0},{"$f":"'26-01-15'!$P22","v":0},null,null,0,0,8,null,null,null,null,null,null,null,null,null,null,null,null,null,0,0]
[9,"PURE BLONDE",{"$f":"'2-11-14'!$P23","v":0},{"$f":"'9-11-14'!$P23","v":0},{"$f":"'16-11-14'!$P23","v":0},{"$f":"'14-12-14'!$P23","v":0},{"$f":"'30-11-14'!$P23","v":0},{"$f":"'7-12-14'!$P23","v":0},{"$f":"'11-01-15'!$P23","v":0},{"$f":"'18-01-15'!$P23","v":0},{"$f":"'25-01-15'!$P23","v":0},{"$f":"'26-01-15'!$P23","v":0},null,null,0,0,9,null,null,null,null,null,null,null,null,null,null,null,null,null,0,0]
[10,"FISHER & PAYKEL",{"$f":"'2-11-14'!$P24","v":0},{"$f":"'9-11-14'!$P24","v":0},{"$f":"'16-11-14'!$P24","v":0},{"$f":"'14-12-14'!$P24","v":0},{"$f":"'30-11-14'!$P24","v":0},{"$f":"'7-12-14'!$P24","v":0},{"$f":"'11-01-15'!$P24","v":0},{"$f":"'18-01-15'!$P24","v":0},{"$f":"'25-01-15'!$P24","v":0},{"$f":"'26-01-15'!$P24","v":0},null,null,0,0,10,null,null,null,null,null,null,null,null,null,null,null,null,null,0,0]
[11,"RED CLAW",{"$f":"'2-11-14'!$P25","v":0},{"$f":"'9-11-14'!$P25","v":0},{"$f":"'16-11-14'!$P25","v":0},{"$f":"'14-12-14'!$P25","v":0},{"$f":"'30-11-14'!$P25","v":0},{"$f":"'7-12-14'!$P25","v":0},{"$f":"'11-01-15'!$P25","v":0},{"$f":"'18-01-15'!$P25","v":0},{"$f":"'25-01-15'!$P25","v":0},{"$f":"'26-01-15'!$P25","v":0},null,null,0,0,11,null,null,null,null,null,null,null,null,null,null,null,null,null,0,0]
[12,"PANASONIC",{"$f":"'2-11-14'!$P26","v":0},{"$f":"'9-11-14'!$P26","v":0},{"$f":"'16-11-14'!$P26","v":0},{"$f":"'14-12-14'!$P26","v":0},{"$f":"'30-11-14'!$P26","v":0},{"$f":"'7-12-14'!$P26","v":0},{"$f":"'11-01-15'!$P26","v":0},{"$f":"'18-01-15'!$P26","v":0},{"$f":"'25-01-15'!$P26","v":0},{"$f":"'26-01-15'!$P26","v":0},null,null,0,0,12,null,null,null,null,null,null,null,null,null,null,null,null,null,0,0]
[13,"SHARKS",{"$f":"'2-11-14'!$P27","v":0},{"$f":"'9-11-14'!$P27","v":0},{"$f":"'16-11-14'!$P27","v":0},{"$f":"'14-12-14'!$P27","v":0},{"$f":"'30-11-14'!$P27","v":0},{"$f":"'7-12-14'!$P27","v":0},{"$f":"'11-01-15'!$P27","v":0},{"$f":"'18-01-15'!$P27","v":0},{"$f":"'25-01-15'!$P27","v":0},{"$f":"'26-01-15'!$P27","v":0},null,null,0,0,13,null,null,null,null,null,null,null,null,null,null,null,null,null,0,0]
[14,"TF COLLECT",{"$f":"'2-11-14'!$P28","v":0},{"$f":"'9-11-14'!$P28","v":0},{"$f":"'16-11-14'!$P28","v":0},{"$f":"'14-12-14'!$P28","v":0},{"$f":"'30-11-14'!$P28","v":0},{"$f":"'7-12-14'!$P28","v":0},{"$f":"'11-01-15'!$P28","v":0},{"$f":"'18-01-15'!$P28","v":0},{"$f":"'25-01-15'!$P28","v":0},{"$f":"'26-01-15'!$P28","v":0},null,null,0,0,14,null,null,null,null,null,null,null,null,null,null,null,null,null,0,0]
[15,"THE KITCHEN MAKER",{"$f":"'2-11-14'!$P29","v":0},{"$f":"'9-11-14'!$P29","v":0},{"$f":"'16-11-14'!$P29","v":0},{"$f":"'14-12-14'!$P29","v":0},{"$f":"'30-11-14'!$P29","v":0},{"$f":"'7-12-14'!$P29","v":0},{"$f":"'11-01-15'!$P29","v":0},{"$f":"'18-01-15'!$P29","v":0},{"$f":"'25-01-15'!$P29","v":0},{"$f":"'26-01-15'!$P29","v":0},null,null,0,0,15,null,null,null,null,null,null,null,null,null,null,null,null,null,0,0]
[16,"PROJECT RACING",{"$f":"'2-11-14'!$P30","v":0},{"$f":"'9-11-14'!$P30","v":0},{"$f":"'16-11-14'!$P30","v":0},{"$f":"'14-12-14'!$P30","v":0},{"$f":"'30-11-14'!$P30","v":0},{"$f":"'7-12-14'!$P30","v":0},{"$f":"'11-01-15'!$P30","v":0},{"$f":"'18-01-15'!$P30","v":0},{"$f":"'25-01-15'!$P30","v":0},{"$f":"'26-01-15'!$P30","v":0},null,null,0,0,16,null,null,null,null,null,null,null,null,null,null,null,null,null,0,0]
[17,"COLDWELL BANKER NEW HOMES",{"$f":"'2-11-14'!$P31","v":0},{"$f":"'9-11-14'!$P31","v":0},{"$f":"'16-11-14'!$P31","v":0},{"$f":"'14-12-14'!$P31","v":0},{"$f":"'30-11-14'!$P31","v":0},{"$f":"'7-12-14'!$P31","v":0},{"$f":"'11-01-15'!$P31","v":0},{"$f":"'18-01-15'!$P31","v":0},{"$f":"'25-01-15'!$P31","v":0},{"$f":"'26-01-15'!$P31","v":0},null,null,0,0,17,null,null,null,null,null,null,null,null,null,null,null,null,null,0,0]
[18,"BOATMATE",{"$f":"'2-11-14'!$P32","v":0},{"$f":"'9-11-14'!$P32","v":0},{"$f":"'16-11-14'!$P32","v":0},{"$f":"'14-12-14'!$P32","v":0},{"$f":"'30-11-14'!$P32","v":0},{"$f":"'7-12-14'!$P32","v":0},{"$f":"'11-01-15'!$P32","v":0},{"$f":"'18-01-15'!$P32","v":0},{"$f":"'25-01-15'!$P32","v":0},{"$f":"'26-01-15'!$P32","v":0},null,null,0,0,18,null,null,null,null,null,null,null,null,null,null,null,null,null,0,0]
[19,null,{"$f":"'2-11-14'!$P33","v":0},{"$f":"'9-11-14'!$P33","v":0},{"$f":"'16-11-14'!$P33","v":0},{"$f":"'14-12-14'!$P33","v":0},{"$f":"'30-11-14'!$P33","v":0},{"$f":"'7-12-14'!$P33","v":0},{"$f":"'11-01-15'!$P33","v":0},{"$f":"'18-01-15'!$P33","v":0},{"$f":"'25-01-15'!$P33","v":0},{"$f":"'26-01-15'!$P33","v":0},null,null,0,0,19,null,null,null,null,null,null,null,null,null,null,null,null,null,0,0]
[20,null,{"$f":"'2-11-14'!$P34","v":0},{"$f":"'9-11-14'!$P34","v":0},{"$f":"'16-11-14'!$P34","v":0},{"$f":"'14-12-14'!$P34","v":0},{"$f":"'30-11-14'!$P34","v":0},{"$f":"'7-12-14'!$P34","v":0},{"$f":"'11-01-15'!$P34","v":0},{"$f":"'18-01-15'!$P34","v":0},{"$f":"'25-01-15'!$P34","v":0},{"$f":"'26-01-15'!$P34","v":0},null,null,0,0,20,null,null,null,null,null,null,null,null,null,null,null,null,null,0,0]
[21,null,{"$f":"'2-11-14'!$P35","v":0},{"$f":"'9-11-14'!$P35","v":0},{"$f":"'16-11-14'!$P35","v":0},{"$f":"'14-12-14'!$P35","v":0},{"$f":"'30-11-14'!$P35","v":0},{"$f":"'7-12-14'!$P35","v":0},{"$f":"'11-01-15'!$P35","v":0},{"$f":"'18-01-15'!$P35","v":0},{"$f":"'25-01-15'!$P35","v":0},{"$f":"'26-01-15'!$P35","v":0},null,null,0,0,21,null,null,null,null,null,null,null,null,null,null,null,null,null,0,0]
[22,null,{"$f":"'2-11-14'!$P36","v":0},{"$f":"'9-11-14'!$P36","v":0},{"$f":"'16-11-14'!$P36","v":0},{"$f":"'14-12-14'!$P36","v":0},{"$f":"'30-11-14'!$P36","v":0},{"$f":"'7-12-14'!$P36","v":0},{"$f":"'11-01-15'!$P36","v":0},{"$f":"'18-01-15'!$P36","v":0},{"$f":"'25-01-15'!$P36","v":0},{"$f":"'26-01-15'!$P36","v":0},null,null,0,0,22,null,null,null,null,null,null,null,null,null,null,null,null,null,0,0]
[23,null,{"$f":"'2-11-14'!$P37","v":0},{"$f":"'9-11-14'!$P37","v":0},{"$f":"'16-11-14'!$P37","v":0},{"$f":"'14-12-14'!$P37","v":0},{"$f":"'30-11-14'!$P37","v":0},{"$f":"'7-12-14'!$P37","v":0},{"$f":"'11-01-15'!$P37","v":0},{"$f":"'18-01-15'!$P37","v":0},{"$f":"'25-01-15'!$P37","v":0},{"$f":"'26-01-15'!$P37","v":0},null,null,0,0,23]
[]
["NOTE:"]